{"text_format":"3","workbook":"xlsx","n_sheets":4,"sheets":[" 01","import danych","Arkusz1","Stan Zbiornika"],"not_rendered":{"macros":1,"external_links":1,"defined_names":5},"read":"whole","date_system":"1900"}

{"sheet":" 01","index":0,"n_rows":200,"n_cols":19,"rows_kept":200,"merged":[[3,9,3,10],[8,16,8,17],[9,16,9,17],[10,16,10,17]]}
[{"$nulls":4},"LINDE 01",{"$nulls":5},{"$f":"VLOOKUP($N$4,$B:$H,7,FALSE)","v":2}]
["Lp.","DATA",null,"GODZINA","PRACOWNIK","Stan motogodzin","ilość zatankowanego paliwa",{"$nulls":3},{"$f":"LOOKUP(DATEVALUE($O$4),$C:$C,A:A)","v":38}]
[{"$f":"IF(ISERROR(MATCH(ROW()-2,Arkusz1!$C:$C,0)),\"\",INDEX(Arkusz1!C:C,MATCH(ROW()-2,Arkusz1!$C:$C,0)))","v":1},{"$f":"IF(ISERROR(MATCH(ROW()-2,Arkusz1!$C:$C,0)),\"\",INDEX('import danych'!$A:$A,MATCH(ROW()-2,Arkusz1!$C:$C,0)+5))","v":""},{"$f":"IF(A3=\"\",\"\",DATEVALUE(B3))","v":{"$error":"#VALUE!"}},{"$f":"IF(ISERROR(MATCH(ROW()-2,Arkusz1!$C:$C,0)),\"\",INDEX('import danych'!$B:$B,MATCH(ROW()-2,Arkusz1!$C:$C,0)+5))","v":""},{"$f":"IF(ISERROR(MATCH(ROW()-2,Arkusz1!$C:$C,0)),\"\",INDEX(Arkusz1!I:I,MATCH(ROW()-2,Arkusz1!$C:$C,0)))","v":"PRACOWNIK"},{"$f":"IF(ISERROR(MATCH(ROW()-2,Arkusz1!$C:$C,0)),\"\",INDEX('import danych'!$H:$H,MATCH(ROW()-2,Arkusz1!$C:$C,0)+5))","v":""},{"$f":"IF(ISERROR(MATCH(ROW()-2,Arkusz1!$C:$C,0)),\"\",INDEX('import danych'!$L:$L,MATCH(ROW()-2,Arkusz1!$C:$C,0)+5))","v":""},{"$f":"A3","v":1},{"$nulls":5},"Data OD:","Data DO:"]
[{"$f":"IF(ISERROR(MATCH(ROW()-2,Arkusz1!$C:$C,0)),\"\",INDEX(Arkusz1!C:C,MATCH(ROW()-2,Arkusz1!$C:$C,0)))","v":2},{"$f":"IF(ISERROR(MATCH(ROW()-2,Arkusz1!$C:$C,0)),\"\",INDEX('import danych'!$A:$A,MATCH(ROW()-2,Arkusz1!$C:$C,0)+5))","v":"2012-09-20"},{"$f":"IF(A4=\"\",\"\",DATEVALUE(B4))","v":41172},{"$f":"IF(ISERROR(MATCH(ROW()-2,Arkusz1!$C:$C,0)),\"\",INDEX('import danych'!$B:$B,MATCH(ROW()-2,Arkusz1!$C:$C,0)+5))","v":"13:24"},{"$f":"IF(ISERROR(MATCH(ROW()-2,Arkusz1!$C:$C,0)),\"\",INDEX(Arkusz1!I:I,MATCH(ROW()-2,Arkusz1!$C:$C,0)))","v":"TEST 1"},{"$f":"IF(ISERROR(MATCH(ROW()-2,Arkusz1!$C:$C,0)),\"\",INDEX('import danych'!$H:$H,MATCH(ROW()-2,Arkusz1!$C:$C,0)+5))","v":13319},{"$f":"IF(ISERROR(MATCH(ROW()-2,Arkusz1!$C:$C,0)),\"\",INDEX('import danych'!$L:$L,MATCH(ROW()-2,Arkusz1!$C:$C,0)+5))","v":1.55},{"$f":"A4","v":2},null,"Raport 01",{"$nulls":3},"2012-09-20","2012-11-01"]
[{"$f":"IF(ISERROR(MATCH(ROW()-2,Arkusz1!$C:$C,0)),\"\",INDEX(Arkusz1!C:C,MATCH(ROW()-2,Arkusz1!$C:$C,0)))","v":3},{"$f":"IF(ISERROR(MATCH(ROW()-2,Arkusz1!$C:$C,0)),\"\",INDEX('import danych'!$A:$A,MATCH(ROW()-2,Arkusz1!$C:$C,0)+5))","v":"2012-09-21"},41173,{"$f":"IF(ISERROR(MATCH(ROW()-2,Arkusz1!$C:$C,0)),\"\",INDEX('import danych'!$B:$B,MATCH(ROW()-2,Arkusz1!$C:$C,0)+5))","v":"13:08"},{"$f":"IF(ISERROR(MATCH(ROW()-2,Arkusz1!$C:$C,0)),\"\",INDEX(Arkusz1!I:I,MATCH(ROW()-2,Arkusz1!$C:$C,0)))","v":{"$error":"#REF!"}},{"$f":"IF(ISERROR(MATCH(ROW()-2,Arkusz1!$C:$C,0)),\"\",INDEX('import danych'!$H:$H,MATCH(ROW()-2,Arkusz1!$C:$C,0)+5))","v":13337},{"$f":"IF(ISERROR(MATCH(ROW()-2,Arkusz1!$C:$C,0)),\"\",INDEX('import danych'!$L:$L,MATCH(ROW()-2,Arkusz1!$C:$C,0)+5))","v":44.480000000000004},3]
[{"$f":"IF(ISERROR(MATCH(ROW()-2,Arkusz1!$C:$C,0)),\"\",INDEX(Arkusz1!C:C,MATCH(ROW()-2,Arkusz1!$C:$C,0)))","v":4},{"$f":"IF(ISERROR(MATCH(ROW()-2,Arkusz1!$C:$C,0)),\"\",INDEX('import danych'!$A:$A,MATCH(ROW()-2,Arkusz1!$C:$C,0)+5))","v":"2012-09-22"},41174,{"$f":"IF(ISERROR(MATCH(ROW()-2,Arkusz1!$C:$C,0)),\"\",INDEX('import danych'!$B:$B,MATCH(ROW()-2,Arkusz1!$C:$C,0)+5))","v":"12:54"},{"$f":"IF(ISERROR(MATCH(ROW()-2,Arkusz1!$C:$C,0)),\"\",INDEX(Arkusz1!I:I,MATCH(ROW()-2,Arkusz1!$C:$C,0)))","v":{"$error":"#REF!"}},{"$f":"IF(ISERROR(MATCH(ROW()-2,Arkusz1!$C:$C,0)),\"\",INDEX('import danych'!$H:$H,MATCH(ROW()-2,Arkusz1!$C:$C,0)+5))","v":13348},{"$f":"IF(ISERROR(MATCH(ROW()-2,Arkusz1!$C:$C,0)),\"\",INDEX('import danych'!$L:$L,MATCH(ROW()-2,Arkusz1!$C:$C,0)+5))","v":31.27},4,null,"Lp.","Data","Godzina","Stan motogodzin","Zatankowane paliwo","Pracownik"]
[{"$f":"IF(ISERROR(MATCH(ROW()-2,Arkusz1!$C:$C,0)),\"\",INDEX(Arkusz1!C:C,MATCH(ROW()-2,Arkusz1!$C:$C,0)))","v":5},{"$f":"IF(ISERROR(MATCH(ROW()-2,Arkusz1!$C:$C,0)),\"\",INDEX('import danych'!$A:$A,MATCH(ROW()-2,Arkusz1!$C:$C,0)+5))","v":"2012-09-24"},41176,{"$f":"IF(ISERROR(MATCH(ROW()-2,Arkusz1!$C:$C,0)),\"\",INDEX('import danych'!$B:$B,MATCH(ROW()-2,Arkusz1!$C:$C,0)+5))","v":"12:36"},{"$f":"IF(ISERROR(MATCH(ROW()-2,Arkusz1!$C:$C,0)),\"\",INDEX(Arkusz1!I:I,MATCH(ROW()-2,Arkusz1!$C:$C,0)))","v":{"$error":"#REF!"}},{"$f":"IF(ISERROR(MATCH(ROW()-2,Arkusz1!$C:$C,0)),\"\",INDEX('import danych'!$H:$H,MATCH(ROW()-2,Arkusz1!$C:$C,0)+5))","v":13354},{"$f":"IF(ISERROR(MATCH(ROW()-2,Arkusz1!$C:$C,0)),\"\",INDEX('import danych'!$L:$L,MATCH(ROW()-2,Arkusz1!$C:$C,0)+5))","v":14.63},5,null,{"$f":"IF(K7=\"\",\"\",ROW()-6)","v":1},{"$f":"LOOKUP($K$1,A:A,B:B)","v":"2012-09-20"},{"$f":"LOOKUP(K1,A:A,D:D)","v":"13:24"},{"$f":"LOOKUP($K1,$A:$A,F:F)","v":13319},{"$f":"LOOKUP($K$1,$A:$A,$G:$G)","v":1.55},1]
[{"$f":"IF(ISERROR(MATCH(ROW()-2,Arkusz1!$C:$C,0)),\"\",INDEX(Arkusz1!C:C,MATCH(ROW()-2,Arkusz1!$C:$C,0)))","v":6},{"$f":"IF(ISERROR(MATCH(ROW()-2,Arkusz1!$C:$C,0)),\"\",INDEX('import danych'!$A:$A,MATCH(ROW()-2,Arkusz1!$C:$C,0)+5))","v":"2012-09-25"},41177,{"$f":"IF(ISERROR(MATCH(ROW()-2,Arkusz1!$C:$C,0)),\"\",INDEX('import danych'!$B:$B,MATCH(ROW()-2,Arkusz1!$C:$C,0)+5))","v":"08:53"},{"$f":"IF(ISERROR(MATCH(ROW()-2,Arkusz1!$C:$C,0)),\"\",INDEX(Arkusz1!I:I,MATCH(ROW()-2,Arkusz1!$C:$C,0)))","v":{"$error":"#REF!"}},{"$f":"IF(ISERROR(MATCH(ROW()-2,Arkusz1!$C:$C,0)),\"\",INDEX('import danych'!$H:$H,MATCH(ROW()-2,Arkusz1!$C:$C,0)+5))","v":13371},{"$f":"IF(ISERROR(MATCH(ROW()-2,Arkusz1!$C:$C,0)),\"\",INDEX('import danych'!$L:$L,MATCH(ROW()-2,Arkusz1!$C:$C,0)+5))","v":43.92},6,null,{"$f":"IF(J7>$K$2-$K$1,\"\",J7+1)","v":2},{"$f":"IF($J8=\"\",\"\",LOOKUP($K$1+$J7,$A:$A,$B:$B))","v":"2012-09-21"},{"$f":"IF($J8=\"\",\"\",LOOKUP($K$1+$J7,$A:$A,$D:$D))","v":"13:08"},{"$f":"IF($J8=\"\",\"\",LOOKUP($K$1+$J7,$A:$A,$F:$F))","v":13337},{"$f":"IF($J8=\"\",\"\",LOOKUP($K$1+$J7,$A:$A,$G:$G))","v":44.480000000000004},2]
[{"$f":"IF(ISERROR(MATCH(ROW()-2,Arkusz1!$C:$C,0)),\"\",INDEX(Arkusz1!C:C,MATCH(ROW()-2,Arkusz1!$C:$C,0)))","v":7},{"$f":"IF(ISERROR(MATCH(ROW()-2,Arkusz1!$C:$C,0)),\"\",INDEX('import danych'!$A:$A,MATCH(ROW()-2,Arkusz1!$C:$C,0)+5))","v":"2012-09-26"},41178,{"$f":"IF(ISERROR(MATCH(ROW()-2,Arkusz1!$C:$C,0)),\"\",INDEX('import danych'!$B:$B,MATCH(ROW()-2,Arkusz1!$C:$C,0)+5))","v":"09:36"},{"$f":"IF(ISERROR(MATCH(ROW()-2,Arkusz1!$C:$C,0)),\"\",INDEX(Arkusz1!I:I,MATCH(ROW()-2,Arkusz1!$C:$C,0)))","v":{"$error":"#REF!"}},{"$f":"IF(ISERROR(MATCH(ROW()-2,Arkusz1!$C:$C,0)),\"\",INDEX('import danych'!$H:$H,MATCH(ROW()-2,Arkusz1!$C:$C,0)+5))","v":13386},{"$f":"IF(ISERROR(MATCH(ROW()-2,Arkusz1!$C:$C,0)),\"\",INDEX('import danych'!$L:$L,MATCH(ROW()-2,Arkusz1!$C:$C,0)+5))","v":41.02},7,null,3,"2012-09-22","12:54",13348,31.27,3,null,"Ilość wykonanych motogodzin:",null,{"$f":"MAX(M:M)-MIN(M:M)","v":555}]
[{"$f":"IF(ISERROR(MATCH(ROW()-2,Arkusz1!$C:$C,0)),\"\",INDEX(Arkusz1!C:C,MATCH(ROW()-2,Arkusz1!$C:$C,0)))","v":8},{"$f":"IF(ISERROR(MATCH(ROW()-2,Arkusz1!$C:$C,0)),\"\",INDEX('import danych'!$A:$A,MATCH(ROW()-2,Arkusz1!$C:$C,0)+5))","v":"2012-09-27"},41179,{"$f":"IF(ISERROR(MATCH(ROW()-2,Arkusz1!$C:$C,0)),\"\",INDEX('import danych'!$B:$B,MATCH(ROW()-2,Arkusz1!$C:$C,0)+5))","v":"11:32"},{"$f":"IF(ISERROR(MATCH(ROW()-2,Arkusz1!$C:$C,0)),\"\",INDEX(Arkusz1!I:I,MATCH(ROW()-2,Arkusz1!$C:$C,0)))","v":{"$error":"#REF!"}},{"$f":"IF(ISERROR(MATCH(ROW()-2,Arkusz1!$C:$C,0)),\"\",INDEX('import danych'!$H:$H,MATCH(ROW()-2,Arkusz1!$C:$C,0)+5))","v":13398},{"$f":"IF(ISERROR(MATCH(ROW()-2,Arkusz1!$C:$C,0)),\"\",INDEX('import danych'!$L:$L,MATCH(ROW()-2,Arkusz1!$C:$C,0)+5))","v":32.57},8,null,4,"2012-09-24","12:36",13354,14.63,4,null,"Ilość zatankowanego paliwa:",null,{"$f":"SUM(N:N)","v":1494.0900000000001}]
[{"$f":"IF(ISERROR(MATCH(ROW()-2,Arkusz1!$C:$C,0)),\"\",INDEX(Arkusz1!C:C,MATCH(ROW()-2,Arkusz1!$C:$C,0)))","v":9},{"$f":"IF(ISERROR(MATCH(ROW()-2,Arkusz1!$C:$C,0)),\"\",INDEX('import danych'!$A:$A,MATCH(ROW()-2,Arkusz1!$C:$C,0)+5))","v":"2012-09-28"},41180,{"$f":"IF(ISERROR(MATCH(ROW()-2,Arkusz1!$C:$C,0)),\"\",INDEX('import danych'!$B:$B,MATCH(ROW()-2,Arkusz1!$C:$C,0)+5))","v":"10:11"},{"$f":"IF(ISERROR(MATCH(ROW()-2,Arkusz1!$C:$C,0)),\"\",INDEX(Arkusz1!I:I,MATCH(ROW()-2,Arkusz1!$C:$C,0)))","v":{"$error":"#REF!"}},{"$f":"IF(ISERROR(MATCH(ROW()-2,Arkusz1!$C:$C,0)),\"\",INDEX('import danych'!$H:$H,MATCH(ROW()-2,Arkusz1!$C:$C,0)+5))","v":13417},{"$f":"IF(ISERROR(MATCH(ROW()-2,Arkusz1!$C:$C,0)),\"\",INDEX('import danych'!$L:$L,MATCH(ROW()-2,Arkusz1!$C:$C,0)+5))","v":52.800000000000004},9,null,5,"2012-09-25","08:53",13371,43.92,5,null,"Średnie zużycie paliwa:",null,{"$f":"S10/S9","v":{"v":2.6920540540540543,"d":"2.692"}}]
[{"$f":"IF(ISERROR(MATCH(ROW()-2,Arkusz1!$C:$C,0)),\"\",INDEX(Arkusz1!C:C,MATCH(ROW()-2,Arkusz1!$C:$C,0)))","v":10},{"$f":"IF(ISERROR(MATCH(ROW()-2,Arkusz1!$C:$C,0)),\"\",INDEX('import danych'!$A:$A,MATCH(ROW()-2,Arkusz1!$C:$C,0)+5))","v":"2012-09-30"},41182,{"$f":"IF(ISERROR(MATCH(ROW()-2,Arkusz1!$C:$C,0)),\"\",INDEX('import danych'!$B:$B,MATCH(ROW()-2,Arkusz1!$C:$C,0)+5))","v":"08:45"},{"$f":"IF(ISERROR(MATCH(ROW()-2,Arkusz1!$C:$C,0)),\"\",INDEX(Arkusz1!I:I,MATCH(ROW()-2,Arkusz1!$C:$C,0)))","v":{"$error":"#REF!"}},{"$f":"IF(ISERROR(MATCH(ROW()-2,Arkusz1!$C:$C,0)),\"\",INDEX('import danych'!$H:$H,MATCH(ROW()-2,Arkusz1!$C:$C,0)+5))","v":13435},{"$f":"IF(ISERROR(MATCH(ROW()-2,Arkusz1!$C:$C,0)),\"\",INDEX('import danych'!$L:$L,MATCH(ROW()-2,Arkusz1!$C:$C,0)+5))","v":50.82},10,null,6,"2012-09-26","09:36",13386,41.02,6]
[{"$f":"IF(ISERROR(MATCH(ROW()-2,Arkusz1!$C:$C,0)),\"\",INDEX(Arkusz1!C:C,MATCH(ROW()-2,Arkusz1!$C:$C,0)))","v":11},{"$f":"IF(ISERROR(MATCH(ROW()-2,Arkusz1!$C:$C,0)),\"\",INDEX('import danych'!$A:$A,MATCH(ROW()-2,Arkusz1!$C:$C,0)+5))","v":"2012-10-01"},41183,{"$f":"IF(ISERROR(MATCH(ROW()-2,Arkusz1!$C:$C,0)),\"\",INDEX('import danych'!$B:$B,MATCH(ROW()-2,Arkusz1!$C:$C,0)+5))","v":"18:56"},{"$f":"IF(ISERROR(MATCH(ROW()-2,Arkusz1!$C:$C,0)),\"\",INDEX(Arkusz1!I:I,MATCH(ROW()-2,Arkusz1!$C:$C,0)))","v":{"$error":"#REF!"}},{"$f":"IF(ISERROR(MATCH(ROW()-2,Arkusz1!$C:$C,0)),\"\",INDEX('import danych'!$H:$H,MATCH(ROW()-2,Arkusz1!$C:$C,0)+5))","v":13455},{"$f":"IF(ISERROR(MATCH(ROW()-2,Arkusz1!$C:$C,0)),\"\",INDEX('import danych'!$L:$L,MATCH(ROW()-2,Arkusz1!$C:$C,0)+5))","v":48.04},11,null,7,"2012-09-27","11:32",13398,32.57,7]
[{"$f":"IF(ISERROR(MATCH(ROW()-2,Arkusz1!$C:$C,0)),\"\",INDEX(Arkusz1!C:C,MATCH(ROW()-2,Arkusz1!$C:$C,0)))","v":12},{"$f":"IF(ISERROR(MATCH(ROW()-2,Arkusz1!$C:$C,0)),\"\",INDEX('import danych'!$A:$A,MATCH(ROW()-2,Arkusz1!$C:$C,0)+5))","v":"2012-10-02"},41184,{"$f":"IF(ISERROR(MATCH(ROW()-2,Arkusz1!$C:$C,0)),\"\",INDEX('import danych'!$B:$B,MATCH(ROW()-2,Arkusz1!$C:$C,0)+5))","v":"13:02"},{"$f":"IF(ISERROR(MATCH(ROW()-2,Arkusz1!$C:$C,0)),\"\",INDEX(Arkusz1!I:I,MATCH(ROW()-2,Arkusz1!$C:$C,0)))","v":{"$error":"#REF!"}},{"$f":"IF(ISERROR(MATCH(ROW()-2,Arkusz1!$C:$C,0)),\"\",INDEX('import danych'!$H:$H,MATCH(ROW()-2,Arkusz1!$C:$C,0)+5))","v":13463},{"$f":"IF(ISERROR(MATCH(ROW()-2,Arkusz1!$C:$C,0)),\"\",INDEX('import danych'!$L:$L,MATCH(ROW()-2,Arkusz1!$C:$C,0)+5))","v":23.7},12,null,8,"2012-09-28","10:11",13417,52.800000000000004,8]
[{"$f":"IF(ISERROR(MATCH(ROW()-2,Arkusz1!$C:$C,0)),\"\",INDEX(Arkusz1!C:C,MATCH(ROW()-2,Arkusz1!$C:$C,0)))","v":13},{"$f":"IF(ISERROR(MATCH(ROW()-2,Arkusz1!$C:$C,0)),\"\",INDEX('import danych'!$A:$A,MATCH(ROW()-2,Arkusz1!$C:$C,0)+5))","v":"2012-10-03"},41185,{"$f":"IF(ISERROR(MATCH(ROW()-2,Arkusz1!$C:$C,0)),\"\",INDEX('import danych'!$B:$B,MATCH(ROW()-2,Arkusz1!$C:$C,0)+5))","v":"13:15"},{"$f":"IF(ISERROR(MATCH(ROW()-2,Arkusz1!$C:$C,0)),\"\",INDEX(Arkusz1!I:I,MATCH(ROW()-2,Arkusz1!$C:$C,0)))","v":{"$error":"#REF!"}},{"$f":"IF(ISERROR(MATCH(ROW()-2,Arkusz1!$C:$C,0)),\"\",INDEX('import danych'!$H:$H,MATCH(ROW()-2,Arkusz1!$C:$C,0)+5))","v":13475},{"$f":"IF(ISERROR(MATCH(ROW()-2,Arkusz1!$C:$C,0)),\"\",INDEX('import danych'!$L:$L,MATCH(ROW()-2,Arkusz1!$C:$C,0)+5))","v":34.78},13,null,9,"2012-09-30","08:45",13435,50.82,9]
[{"$f":"IF(ISERROR(MATCH(ROW()-2,Arkusz1!$C:$C,0)),\"\",INDEX(Arkusz1!C:C,MATCH(ROW()-2,Arkusz1!$C:$C,0)))","v":14},{"$f":"IF(ISERROR(MATCH(ROW()-2,Arkusz1!$C:$C,0)),\"\",INDEX('import danych'!$A:$A,MATCH(ROW()-2,Arkusz1!$C:$C,0)+5))","v":"2012-10-04"},41186,{"$f":"IF(ISERROR(MATCH(ROW()-2,Arkusz1!$C:$C,0)),\"\",INDEX('import danych'!$B:$B,MATCH(ROW()-2,Arkusz1!$C:$C,0)+5))","v":"13:21"},{"$f":"IF(ISERROR(MATCH(ROW()-2,Arkusz1!$C:$C,0)),\"\",INDEX(Arkusz1!I:I,MATCH(ROW()-2,Arkusz1!$C:$C,0)))","v":{"$error":"#REF!"}},{"$f":"IF(ISERROR(MATCH(ROW()-2,Arkusz1!$C:$C,0)),\"\",INDEX('import danych'!$H:$H,MATCH(ROW()-2,Arkusz1!$C:$C,0)+5))","v":13493},{"$f":"IF(ISERROR(MATCH(ROW()-2,Arkusz1!$C:$C,0)),\"\",INDEX('import danych'!$L:$L,MATCH(ROW()-2,Arkusz1!$C:$C,0)+5))","v":49.26},14,null,10,"2012-10-01","18:56",13455,48.04,10]
[{"$f":"IF(ISERROR(MATCH(ROW()-2,Arkusz1!$C:$C,0)),\"\",INDEX(Arkusz1!C:C,MATCH(ROW()-2,Arkusz1!$C:$C,0)))","v":15},{"$f":"IF(ISERROR(MATCH(ROW()-2,Arkusz1!$C:$C,0)),\"\",INDEX('import danych'!$A:$A,MATCH(ROW()-2,Arkusz1!$C:$C,0)+5))","v":"2012-10-05"},41187,{"$f":"IF(ISERROR(MATCH(ROW()-2,Arkusz1!$C:$C,0)),\"\",INDEX('import danych'!$B:$B,MATCH(ROW()-2,Arkusz1!$C:$C,0)+5))","v":"13:07"},{"$f":"IF(ISERROR(MATCH(ROW()-2,Arkusz1!$C:$C,0)),\"\",INDEX(Arkusz1!I:I,MATCH(ROW()-2,Arkusz1!$C:$C,0)))","v":{"$error":"#REF!"}},{"$f":"IF(ISERROR(MATCH(ROW()-2,Arkusz1!$C:$C,0)),\"\",INDEX('import danych'!$H:$H,MATCH(ROW()-2,Arkusz1!$C:$C,0)+5))","v":13509},{"$f":"IF(ISERROR(MATCH(ROW()-2,Arkusz1!$C:$C,0)),\"\",INDEX('import danych'!$L:$L,MATCH(ROW()-2,Arkusz1!$C:$C,0)+5))","v":45.18},15,null,11,"2012-10-02","13:02",13463,23.7,11]
[{"$f":"IF(ISERROR(MATCH(ROW()-2,Arkusz1!$C:$C,0)),\"\",INDEX(Arkusz1!C:C,MATCH(ROW()-2,Arkusz1!$C:$C,0)))","v":16},{"$f":"IF(ISERROR(MATCH(ROW()-2,Arkusz1!$C:$C,0)),\"\",INDEX('import danych'!$A:$A,MATCH(ROW()-2,Arkusz1!$C:$C,0)+5))","v":"2012-10-06"},41188,{"$f":"IF(ISERROR(MATCH(ROW()-2,Arkusz1!$C:$C,0)),\"\",INDEX('import danych'!$B:$B,MATCH(ROW()-2,Arkusz1!$C:$C,0)+5))","v":"12:58"},{"$f":"IF(ISERROR(MATCH(ROW()-2,Arkusz1!$C:$C,0)),\"\",INDEX(Arkusz1!I:I,MATCH(ROW()-2,Arkusz1!$C:$C,0)))","v":{"$error":"#REF!"}},{"$f":"IF(ISERROR(MATCH(ROW()-2,Arkusz1!$C:$C,0)),\"\",INDEX('import danych'!$H:$H,MATCH(ROW()-2,Arkusz1!$C:$C,0)+5))","v":13523},{"$f":"IF(ISERROR(MATCH(ROW()-2,Arkusz1!$C:$C,0)),\"\",INDEX('import danych'!$L:$L,MATCH(ROW()-2,Arkusz1!$C:$C,0)+5))","v":35.3},16,null,12,"2012-10-03","13:15",13475,34.78,12]
[{"$f":"IF(ISERROR(MATCH(ROW()-2,Arkusz1!$C:$C,0)),\"\",INDEX(Arkusz1!C:C,MATCH(ROW()-2,Arkusz1!$C:$C,0)))","v":17},{"$f":"IF(ISERROR(MATCH(ROW()-2,Arkusz1!$C:$C,0)),\"\",INDEX('import danych'!$A:$A,MATCH(ROW()-2,Arkusz1!$C:$C,0)+5))","v":"2012-10-08"},41190,{"$f":"IF(ISERROR(MATCH(ROW()-2,Arkusz1!$C:$C,0)),\"\",INDEX('import danych'!$B:$B,MATCH(ROW()-2,Arkusz1!$C:$C,0)+5))","v":"13:19"},{"$f":"IF(ISERROR(MATCH(ROW()-2,Arkusz1!$C:$C,0)),\"\",INDEX(Arkusz1!I:I,MATCH(ROW()-2,Arkusz1!$C:$C,0)))","v":{"$error":"#REF!"}},{"$f":"IF(ISERROR(MATCH(ROW()-2,Arkusz1!$C:$C,0)),\"\",INDEX('import danych'!$H:$H,MATCH(ROW()-2,Arkusz1!$C:$C,0)+5))","v":13532},{"$f":"IF(ISERROR(MATCH(ROW()-2,Arkusz1!$C:$C,0)),\"\",INDEX('import danych'!$L:$L,MATCH(ROW()-2,Arkusz1!$C:$C,0)+5))","v":23.29},17,null,13,"2012-10-04","13:21",13493,49.26,13]
[{"$f":"IF(ISERROR(MATCH(ROW()-2,Arkusz1!$C:$C,0)),\"\",INDEX(Arkusz1!C:C,MATCH(ROW()-2,Arkusz1!$C:$C,0)))","v":18},{"$f":"IF(ISERROR(MATCH(ROW()-2,Arkusz1!$C:$C,0)),\"\",INDEX('import danych'!$A:$A,MATCH(ROW()-2,Arkusz1!$C:$C,0)+5))","v":"2012-10-09"},41191,{"$f":"IF(ISERROR(MATCH(ROW()-2,Arkusz1!$C:$C,0)),\"\",INDEX('import danych'!$B:$B,MATCH(ROW()-2,Arkusz1!$C:$C,0)+5))","v":"11:33"},{"$f":"IF(ISERROR(MATCH(ROW()-2,Arkusz1!$C:$C,0)),\"\",INDEX(Arkusz1!I:I,MATCH(ROW()-2,Arkusz1!$C:$C,0)))","v":{"$error":"#REF!"}},{"$f":"IF(ISERROR(MATCH(ROW()-2,Arkusz1!$C:$C,0)),\"\",INDEX('import danych'!$H:$H,MATCH(ROW()-2,Arkusz1!$C:$C,0)+5))","v":13550},{"$f":"IF(ISERROR(MATCH(ROW()-2,Arkusz1!$C:$C,0)),\"\",INDEX('import danych'!$L:$L,MATCH(ROW()-2,Arkusz1!$C:$C,0)+5))","v":45.86},18,null,14,"2012-10-05","13:07",13509,45.18,14]
[{"$f":"IF(ISERROR(MATCH(ROW()-2,Arkusz1!$C:$C,0)),\"\",INDEX(Arkusz1!C:C,MATCH(ROW()-2,Arkusz1!$C:$C,0)))","v":19},{"$f":"IF(ISERROR(MATCH(ROW()-2,Arkusz1!$C:$C,0)),\"\",INDEX('import danych'!$A:$A,MATCH(ROW()-2,Arkusz1!$C:$C,0)+5))","v":"2012-10-10"},41192,{"$f":"IF(ISERROR(MATCH(ROW()-2,Arkusz1!$C:$C,0)),\"\",INDEX('import danych'!$B:$B,MATCH(ROW()-2,Arkusz1!$C:$C,0)+5))","v":"08:45"},{"$f":"IF(ISERROR(MATCH(ROW()-2,Arkusz1!$C:$C,0)),\"\",INDEX(Arkusz1!I:I,MATCH(ROW()-2,Arkusz1!$C:$C,0)))","v":{"$error":"#REF!"}},{"$f":"IF(ISERROR(MATCH(ROW()-2,Arkusz1!$C:$C,0)),\"\",INDEX('import danych'!$H:$H,MATCH(ROW()-2,Arkusz1!$C:$C,0)+5))","v":13565},{"$f":"IF(ISERROR(MATCH(ROW()-2,Arkusz1!$C:$C,0)),\"\",INDEX('import danych'!$L:$L,MATCH(ROW()-2,Arkusz1!$C:$C,0)+5))","v":45.59},19,null,15,"2012-10-06","12:58",13523,35.3,15]
[{"$f":"IF(ISERROR(MATCH(ROW()-2,Arkusz1!$C:$C,0)),\"\",INDEX(Arkusz1!C:C,MATCH(ROW()-2,Arkusz1!$C:$C,0)))","v":20},{"$f":"IF(ISERROR(MATCH(ROW()-2,Arkusz1!$C:$C,0)),\"\",INDEX('import danych'!$A:$A,MATCH(ROW()-2,Arkusz1!$C:$C,0)+5))","v":"2012-10-11"},41193,{"$f":"IF(ISERROR(MATCH(ROW()-2,Arkusz1!$C:$C,0)),\"\",INDEX('import danych'!$B:$B,MATCH(ROW()-2,Arkusz1!$C:$C,0)+5))","v":"10:23"},{"$f":"IF(ISERROR(MATCH(ROW()-2,Arkusz1!$C:$C,0)),\"\",INDEX(Arkusz1!I:I,MATCH(ROW()-2,Arkusz1!$C:$C,0)))","v":{"$error":"#REF!"}},{"$f":"IF(ISERROR(MATCH(ROW()-2,Arkusz1!$C:$C,0)),\"\",INDEX('import danych'!$H:$H,MATCH(ROW()-2,Arkusz1!$C:$C,0)+5))","v":13584},{"$f":"IF(ISERROR(MATCH(ROW()-2,Arkusz1!$C:$C,0)),\"\",INDEX('import danych'!$L:$L,MATCH(ROW()-2,Arkusz1!$C:$C,0)+5))","v":44.96},20,null,16,"2012-10-08","13:19",13532,23.29,16]
[{"$f":"IF(ISERROR(MATCH(ROW()-2,Arkusz1!$C:$C,0)),\"\",INDEX(Arkusz1!C:C,MATCH(ROW()-2,Arkusz1!$C:$C,0)))","v":21},{"$f":"IF(ISERROR(MATCH(ROW()-2,Arkusz1!$C:$C,0)),\"\",INDEX('import danych'!$A:$A,MATCH(ROW()-2,Arkusz1!$C:$C,0)+5))","v":"2012-10-12"},41194,{"$f":"IF(ISERROR(MATCH(ROW()-2,Arkusz1!$C:$C,0)),\"\",INDEX('import danych'!$B:$B,MATCH(ROW()-2,Arkusz1!$C:$C,0)+5))","v":"11:27"},{"$f":"IF(ISERROR(MATCH(ROW()-2,Arkusz1!$C:$C,0)),\"\",INDEX(Arkusz1!I:I,MATCH(ROW()-2,Arkusz1!$C:$C,0)))","v":{"$error":"#REF!"}},{"$f":"IF(ISERROR(MATCH(ROW()-2,Arkusz1!$C:$C,0)),\"\",INDEX('import danych'!$H:$H,MATCH(ROW()-2,Arkusz1!$C:$C,0)+5))","v":13599},{"$f":"IF(ISERROR(MATCH(ROW()-2,Arkusz1!$C:$C,0)),\"\",INDEX('import danych'!$L:$L,MATCH(ROW()-2,Arkusz1!$C:$C,0)+5))","v":39.89},21,null,17,"2012-10-09","11:33",13550,45.86,17]
[{"$f":"IF(ISERROR(MATCH(ROW()-2,Arkusz1!$C:$C,0)),\"\",INDEX(Arkusz1!C:C,MATCH(ROW()-2,Arkusz1!$C:$C,0)))","v":22},{"$f":"IF(ISERROR(MATCH(ROW()-2,Arkusz1!$C:$C,0)),\"\",INDEX('import danych'!$A:$A,MATCH(ROW()-2,Arkusz1!$C:$C,0)+5))","v":"2012-10-14"},41196,{"$f":"IF(ISERROR(MATCH(ROW()-2,Arkusz1!$C:$C,0)),\"\",INDEX('import danych'!$B:$B,MATCH(ROW()-2,Arkusz1!$C:$C,0)+5))","v":"10:31"},{"$f":"IF(ISERROR(MATCH(ROW()-2,Arkusz1!$C:$C,0)),\"\",INDEX(Arkusz1!I:I,MATCH(ROW()-2,Arkusz1!$C:$C,0)))","v":{"$error":"#REF!"}},{"$f":"IF(ISERROR(MATCH(ROW()-2,Arkusz1!$C:$C,0)),\"\",INDEX('import danych'!$H:$H,MATCH(ROW()-2,Arkusz1!$C:$C,0)+5))","v":13618},{"$f":"IF(ISERROR(MATCH(ROW()-2,Arkusz1!$C:$C,0)),\"\",INDEX('import danych'!$L:$L,MATCH(ROW()-2,Arkusz1!$C:$C,0)+5))","v":48.27},22,null,18,"2012-10-10","08:45",13565,45.59,18]
[{"$f":"IF(ISERROR(MATCH(ROW()-2,Arkusz1!$C:$C,0)),\"\",INDEX(Arkusz1!C:C,MATCH(ROW()-2,Arkusz1!$C:$C,0)))","v":23},{"$f":"IF(ISERROR(MATCH(ROW()-2,Arkusz1!$C:$C,0)),\"\",INDEX('import danych'!$A:$A,MATCH(ROW()-2,Arkusz1!$C:$C,0)+5))","v":"2012-10-15"},41197,{"$f":"IF(ISERROR(MATCH(ROW()-2,Arkusz1!$C:$C,0)),\"\",INDEX('import danych'!$B:$B,MATCH(ROW()-2,Arkusz1!$C:$C,0)+5))","v":"13:01"},{"$f":"IF(ISERROR(MATCH(ROW()-2,Arkusz1!$C:$C,0)),\"\",INDEX(Arkusz1!I:I,MATCH(ROW()-2,Arkusz1!$C:$C,0)))","v":{"$error":"#REF!"}},{"$f":"IF(ISERROR(MATCH(ROW()-2,Arkusz1!$C:$C,0)),\"\",INDEX('import danych'!$H:$H,MATCH(ROW()-2,Arkusz1!$C:$C,0)+5))","v":13624},{"$f":"IF(ISERROR(MATCH(ROW()-2,Arkusz1!$C:$C,0)),\"\",INDEX('import danych'!$L:$L,MATCH(ROW()-2,Arkusz1!$C:$C,0)+5))","v":22.09},23,null,19,"2012-10-11","10:23",13584,44.96,19]
[{"$f":"IF(ISERROR(MATCH(ROW()-2,Arkusz1!$C:$C,0)),\"\",INDEX(Arkusz1!C:C,MATCH(ROW()-2,Arkusz1!$C:$C,0)))","v":24},{"$f":"IF(ISERROR(MATCH(ROW()-2,Arkusz1!$C:$C,0)),\"\",INDEX('import danych'!$A:$A,MATCH(ROW()-2,Arkusz1!$C:$C,0)+5))","v":"2012-10-16"},41198,{"$f":"IF(ISERROR(MATCH(ROW()-2,Arkusz1!$C:$C,0)),\"\",INDEX('import danych'!$B:$B,MATCH(ROW()-2,Arkusz1!$C:$C,0)+5))","v":"11:18"},{"$f":"IF(ISERROR(MATCH(ROW()-2,Arkusz1!$C:$C,0)),\"\",INDEX(Arkusz1!I:I,MATCH(ROW()-2,Arkusz1!$C:$C,0)))","v":{"$error":"#REF!"}},{"$f":"IF(ISERROR(MATCH(ROW()-2,Arkusz1!$C:$C,0)),\"\",INDEX('import danych'!$H:$H,MATCH(ROW()-2,Arkusz1!$C:$C,0)+5))","v":13641},{"$f":"IF(ISERROR(MATCH(ROW()-2,Arkusz1!$C:$C,0)),\"\",INDEX('import danych'!$L:$L,MATCH(ROW()-2,Arkusz1!$C:$C,0)+5))","v":50.52},24,null,20,"2012-10-12","11:27",13599,39.89,20]
[{"$f":"IF(ISERROR(MATCH(ROW()-2,Arkusz1!$C:$C,0)),\"\",INDEX(Arkusz1!C:C,MATCH(ROW()-2,Arkusz1!$C:$C,0)))","v":25},{"$f":"IF(ISERROR(MATCH(ROW()-2,Arkusz1!$C:$C,0)),\"\",INDEX('import danych'!$A:$A,MATCH(ROW()-2,Arkusz1!$C:$C,0)+5))","v":"2012-10-17"},41199,{"$f":"IF(ISERROR(MATCH(ROW()-2,Arkusz1!$C:$C,0)),\"\",INDEX('import danych'!$B:$B,MATCH(ROW()-2,Arkusz1!$C:$C,0)+5))","v":"11:08"},{"$f":"IF(ISERROR(MATCH(ROW()-2,Arkusz1!$C:$C,0)),\"\",INDEX(Arkusz1!I:I,MATCH(ROW()-2,Arkusz1!$C:$C,0)))","v":{"$error":"#REF!"}},{"$f":"IF(ISERROR(MATCH(ROW()-2,Arkusz1!$C:$C,0)),\"\",INDEX('import danych'!$H:$H,MATCH(ROW()-2,Arkusz1!$C:$C,0)+5))","v":13661},{"$f":"IF(ISERROR(MATCH(ROW()-2,Arkusz1!$C:$C,0)),\"\",INDEX('import danych'!$L:$L,MATCH(ROW()-2,Arkusz1!$C:$C,0)+5))","v":50.39},25,null,21,"2012-10-14","10:31",13618,48.27,21]
[{"$f":"IF(ISERROR(MATCH(ROW()-2,Arkusz1!$C:$C,0)),\"\",INDEX(Arkusz1!C:C,MATCH(ROW()-2,Arkusz1!$C:$C,0)))","v":26},{"$f":"IF(ISERROR(MATCH(ROW()-2,Arkusz1!$C:$C,0)),\"\",INDEX('import danych'!$A:$A,MATCH(ROW()-2,Arkusz1!$C:$C,0)+5))","v":"2012-10-18"},41200,{"$f":"IF(ISERROR(MATCH(ROW()-2,Arkusz1!$C:$C,0)),\"\",INDEX('import danych'!$B:$B,MATCH(ROW()-2,Arkusz1!$C:$C,0)+5))","v":"11:03"},{"$f":"IF(ISERROR(MATCH(ROW()-2,Arkusz1!$C:$C,0)),\"\",INDEX(Arkusz1!I:I,MATCH(ROW()-2,Arkusz1!$C:$C,0)))","v":{"$error":"#REF!"}},{"$f":"IF(ISERROR(MATCH(ROW()-2,Arkusz1!$C:$C,0)),\"\",INDEX('import danych'!$H:$H,MATCH(ROW()-2,Arkusz1!$C:$C,0)+5))","v":13682},{"$f":"IF(ISERROR(MATCH(ROW()-2,Arkusz1!$C:$C,0)),\"\",INDEX('import danych'!$L:$L,MATCH(ROW()-2,Arkusz1!$C:$C,0)+5))","v":52.42},26,null,22,"2012-10-15","13:01",13624,22.09,22]
[{"$f":"IF(ISERROR(MATCH(ROW()-2,Arkusz1!$C:$C,0)),\"\",INDEX(Arkusz1!C:C,MATCH(ROW()-2,Arkusz1!$C:$C,0)))","v":27},{"$f":"IF(ISERROR(MATCH(ROW()-2,Arkusz1!$C:$C,0)),\"\",INDEX('import danych'!$A:$A,MATCH(ROW()-2,Arkusz1!$C:$C,0)+5))","v":"2012-10-19"},41201,{"$f":"IF(ISERROR(MATCH(ROW()-2,Arkusz1!$C:$C,0)),\"\",INDEX('import danych'!$B:$B,MATCH(ROW()-2,Arkusz1!$C:$C,0)+5))","v":"13:32"},{"$f":"IF(ISERROR(MATCH(ROW()-2,Arkusz1!$C:$C,0)),\"\",INDEX(Arkusz1!I:I,MATCH(ROW()-2,Arkusz1!$C:$C,0)))","v":{"$error":"#REF!"}},{"$f":"IF(ISERROR(MATCH(ROW()-2,Arkusz1!$C:$C,0)),\"\",INDEX('import danych'!$H:$H,MATCH(ROW()-2,Arkusz1!$C:$C,0)+5))","v":13701},{"$f":"IF(ISERROR(MATCH(ROW()-2,Arkusz1!$C:$C,0)),\"\",INDEX('import danych'!$L:$L,MATCH(ROW()-2,Arkusz1!$C:$C,0)+5))","v":50.82},27,null,23,"2012-10-16","11:18",13641,50.52,23]
[{"$f":"IF(ISERROR(MATCH(ROW()-2,Arkusz1!$C:$C,0)),\"\",INDEX(Arkusz1!C:C,MATCH(ROW()-2,Arkusz1!$C:$C,0)))","v":28},{"$f":"IF(ISERROR(MATCH(ROW()-2,Arkusz1!$C:$C,0)),\"\",INDEX('import danych'!$A:$A,MATCH(ROW()-2,Arkusz1!$C:$C,0)+5))","v":"2012-10-20"},41202,{"$f":"IF(ISERROR(MATCH(ROW()-2,Arkusz1!$C:$C,0)),\"\",INDEX('import danych'!$B:$B,MATCH(ROW()-2,Arkusz1!$C:$C,0)+5))","v":"13:06"},{"$f":"IF(ISERROR(MATCH(ROW()-2,Arkusz1!$C:$C,0)),\"\",INDEX(Arkusz1!I:I,MATCH(ROW()-2,Arkusz1!$C:$C,0)))","v":{"$error":"#REF!"}},{"$f":"IF(ISERROR(MATCH(ROW()-2,Arkusz1!$C:$C,0)),\"\",INDEX('import danych'!$H:$H,MATCH(ROW()-2,Arkusz1!$C:$C,0)+5))","v":13713},{"$f":"IF(ISERROR(MATCH(ROW()-2,Arkusz1!$C:$C,0)),\"\",INDEX('import danych'!$L:$L,MATCH(ROW()-2,Arkusz1!$C:$C,0)+5))","v":40.05},28,null,24,"2012-10-17","11:08",13661,50.39,24]
[{"$f":"IF(ISERROR(MATCH(ROW()-2,Arkusz1!$C:$C,0)),\"\",INDEX(Arkusz1!C:C,MATCH(ROW()-2,Arkusz1!$C:$C,0)))","v":29},{"$f":"IF(ISERROR(MATCH(ROW()-2,Arkusz1!$C:$C,0)),\"\",INDEX('import danych'!$A:$A,MATCH(ROW()-2,Arkusz1!$C:$C,0)+5))","v":"2012-10-22"},41204,{"$f":"IF(ISERROR(MATCH(ROW()-2,Arkusz1!$C:$C,0)),\"\",INDEX('import danych'!$B:$B,MATCH(ROW()-2,Arkusz1!$C:$C,0)+5))","v":"12:58"},{"$f":"IF(ISERROR(MATCH(ROW()-2,Arkusz1!$C:$C,0)),\"\",INDEX(Arkusz1!I:I,MATCH(ROW()-2,Arkusz1!$C:$C,0)))","v":{"$error":"#REF!"}},{"$f":"IF(ISERROR(MATCH(ROW()-2,Arkusz1!$C:$C,0)),\"\",INDEX('import danych'!$H:$H,MATCH(ROW()-2,Arkusz1!$C:$C,0)+5))","v":13731},{"$f":"IF(ISERROR(MATCH(ROW()-2,Arkusz1!$C:$C,0)),\"\",INDEX('import danych'!$L:$L,MATCH(ROW()-2,Arkusz1!$C:$C,0)+5))","v":42.97},29,null,25,"2012-10-18","11:03",13682,52.42,25]
[{"$f":"IF(ISERROR(MATCH(ROW()-2,Arkusz1!$C:$C,0)),\"\",INDEX(Arkusz1!C:C,MATCH(ROW()-2,Arkusz1!$C:$C,0)))","v":30},{"$f":"IF(ISERROR(MATCH(ROW()-2,Arkusz1!$C:$C,0)),\"\",INDEX('import danych'!$A:$A,MATCH(ROW()-2,Arkusz1!$C:$C,0)+5))","v":"2012-10-23"},41205,{"$f":"IF(ISERROR(MATCH(ROW()-2,Arkusz1!$C:$C,0)),\"\",INDEX('import danych'!$B:$B,MATCH(ROW()-2,Arkusz1!$C:$C,0)+5))","v":"13:06"},{"$f":"IF(ISERROR(MATCH(ROW()-2,Arkusz1!$C:$C,0)),\"\",INDEX(Arkusz1!I:I,MATCH(ROW()-2,Arkusz1!$C:$C,0)))","v":{"$error":"#REF!"}},{"$f":"IF(ISERROR(MATCH(ROW()-2,Arkusz1!$C:$C,0)),\"\",INDEX('import danych'!$H:$H,MATCH(ROW()-2,Arkusz1!$C:$C,0)+5))","v":13750},{"$f":"IF(ISERROR(MATCH(ROW()-2,Arkusz1!$C:$C,0)),\"\",INDEX('import danych'!$L:$L,MATCH(ROW()-2,Arkusz1!$C:$C,0)+5))","v":50.480000000000004},30,null,26,"2012-10-19","13:32",13701,50.82,26]
[{"$f":"IF(ISERROR(MATCH(ROW()-2,Arkusz1!$C:$C,0)),\"\",INDEX(Arkusz1!C:C,MATCH(ROW()-2,Arkusz1!$C:$C,0)))","v":31},{"$f":"IF(ISERROR(MATCH(ROW()-2,Arkusz1!$C:$C,0)),\"\",INDEX('import danych'!$A:$A,MATCH(ROW()-2,Arkusz1!$C:$C,0)+5))","v":"2012-10-24"},41206,{"$f":"IF(ISERROR(MATCH(ROW()-2,Arkusz1!$C:$C,0)),\"\",INDEX('import danych'!$B:$B,MATCH(ROW()-2,Arkusz1!$C:$C,0)+5))","v":"13:04"},{"$f":"IF(ISERROR(MATCH(ROW()-2,Arkusz1!$C:$C,0)),\"\",INDEX(Arkusz1!I:I,MATCH(ROW()-2,Arkusz1!$C:$C,0)))","v":{"$error":"#REF!"}},{"$f":"IF(ISERROR(MATCH(ROW()-2,Arkusz1!$C:$C,0)),\"\",INDEX('import danych'!$H:$H,MATCH(ROW()-2,Arkusz1!$C:$C,0)+5))","v":13768},{"$f":"IF(ISERROR(MATCH(ROW()-2,Arkusz1!$C:$C,0)),\"\",INDEX('import danych'!$L:$L,MATCH(ROW()-2,Arkusz1!$C:$C,0)+5))","v":49.19},31,null,27,"2012-10-20","13:06",13713,40.05,27]
[{"$f":"IF(ISERROR(MATCH(ROW()-2,Arkusz1!$C:$C,0)),\"\",INDEX(Arkusz1!C:C,MATCH(ROW()-2,Arkusz1!$C:$C,0)))","v":32},{"$f":"IF(ISERROR(MATCH(ROW()-2,Arkusz1!$C:$C,0)),\"\",INDEX('import danych'!$A:$A,MATCH(ROW()-2,Arkusz1!$C:$C,0)+5))","v":"2012-10-25"},41207,{"$f":"IF(ISERROR(MATCH(ROW()-2,Arkusz1!$C:$C,0)),\"\",INDEX('import danych'!$B:$B,MATCH(ROW()-2,Arkusz1!$C:$C,0)+5))","v":"13:23"},{"$f":"IF(ISERROR(MATCH(ROW()-2,Arkusz1!$C:$C,0)),\"\",INDEX(Arkusz1!I:I,MATCH(ROW()-2,Arkusz1!$C:$C,0)))","v":{"$error":"#REF!"}},{"$f":"IF(ISERROR(MATCH(ROW()-2,Arkusz1!$C:$C,0)),\"\",INDEX('import danych'!$H:$H,MATCH(ROW()-2,Arkusz1!$C:$C,0)+5))","v":13785},{"$f":"IF(ISERROR(MATCH(ROW()-2,Arkusz1!$C:$C,0)),\"\",INDEX('import danych'!$L:$L,MATCH(ROW()-2,Arkusz1!$C:$C,0)+5))","v":53.230000000000004},32,null,28,"2012-10-22","12:58",13731,42.97,28]
[{"$f":"IF(ISERROR(MATCH(ROW()-2,Arkusz1!$C:$C,0)),\"\",INDEX(Arkusz1!C:C,MATCH(ROW()-2,Arkusz1!$C:$C,0)))","v":33},{"$f":"IF(ISERROR(MATCH(ROW()-2,Arkusz1!$C:$C,0)),\"\",INDEX('import danych'!$A:$A,MATCH(ROW()-2,Arkusz1!$C:$C,0)+5))","v":"2012-10-26"},41208,{"$f":"IF(ISERROR(MATCH(ROW()-2,Arkusz1!$C:$C,0)),\"\",INDEX('import danych'!$B:$B,MATCH(ROW()-2,Arkusz1!$C:$C,0)+5))","v":"18:39"},{"$f":"IF(ISERROR(MATCH(ROW()-2,Arkusz1!$C:$C,0)),\"\",INDEX(Arkusz1!I:I,MATCH(ROW()-2,Arkusz1!$C:$C,0)))","v":{"$error":"#REF!"}},{"$f":"IF(ISERROR(MATCH(ROW()-2,Arkusz1!$C:$C,0)),\"\",INDEX('import danych'!$H:$H,MATCH(ROW()-2,Arkusz1!$C:$C,0)+5))","v":13803},{"$f":"IF(ISERROR(MATCH(ROW()-2,Arkusz1!$C:$C,0)),\"\",INDEX('import danych'!$L:$L,MATCH(ROW()-2,Arkusz1!$C:$C,0)+5))","v":48.36},33,null,29,"2012-10-23","13:06",13750,50.480000000000004,29]
[{"$f":"IF(ISERROR(MATCH(ROW()-2,Arkusz1!$C:$C,0)),\"\",INDEX(Arkusz1!C:C,MATCH(ROW()-2,Arkusz1!$C:$C,0)))","v":34},{"$f":"IF(ISERROR(MATCH(ROW()-2,Arkusz1!$C:$C,0)),\"\",INDEX('import danych'!$A:$A,MATCH(ROW()-2,Arkusz1!$C:$C,0)+5))","v":"2012-10-28"},41210,{"$f":"IF(ISERROR(MATCH(ROW()-2,Arkusz1!$C:$C,0)),\"\",INDEX('import danych'!$B:$B,MATCH(ROW()-2,Arkusz1!$C:$C,0)+5))","v":"12:45"},{"$f":"IF(ISERROR(MATCH(ROW()-2,Arkusz1!$C:$C,0)),\"\",INDEX(Arkusz1!I:I,MATCH(ROW()-2,Arkusz1!$C:$C,0)))","v":{"$error":"#REF!"}},{"$f":"IF(ISERROR(MATCH(ROW()-2,Arkusz1!$C:$C,0)),\"\",INDEX('import danych'!$H:$H,MATCH(ROW()-2,Arkusz1!$C:$C,0)+5))","v":13817},{"$f":"IF(ISERROR(MATCH(ROW()-2,Arkusz1!$C:$C,0)),\"\",INDEX('import danych'!$L:$L,MATCH(ROW()-2,Arkusz1!$C:$C,0)+5))","v":35.18},34,null,30,"2012-10-24","13:04",13768,49.19,30]
[{"$f":"IF(ISERROR(MATCH(ROW()-2,Arkusz1!$C:$C,0)),\"\",INDEX(Arkusz1!C:C,MATCH(ROW()-2,Arkusz1!$C:$C,0)))","v":35},{"$f":"IF(ISERROR(MATCH(ROW()-2,Arkusz1!$C:$C,0)),\"\",INDEX('import danych'!$A:$A,MATCH(ROW()-2,Arkusz1!$C:$C,0)+5))","v":"2012-10-29"},41211,{"$f":"IF(ISERROR(MATCH(ROW()-2,Arkusz1!$C:$C,0)),\"\",INDEX('import danych'!$B:$B,MATCH(ROW()-2,Arkusz1!$C:$C,0)+5))","v":"13:54"},{"$f":"IF(ISERROR(MATCH(ROW()-2,Arkusz1!$C:$C,0)),\"\",INDEX(Arkusz1!I:I,MATCH(ROW()-2,Arkusz1!$C:$C,0)))","v":{"$error":"#REF!"}},{"$f":"IF(ISERROR(MATCH(ROW()-2,Arkusz1!$C:$C,0)),\"\",INDEX('import danych'!$H:$H,MATCH(ROW()-2,Arkusz1!$C:$C,0)+5))","v":13823},{"$f":"IF(ISERROR(MATCH(ROW()-2,Arkusz1!$C:$C,0)),\"\",INDEX('import danych'!$L:$L,MATCH(ROW()-2,Arkusz1!$C:$C,0)+5))","v":19.78},35,null,31,"2012-10-25","13:23",13785,53.230000000000004,31]
[{"$f":"IF(ISERROR(MATCH(ROW()-2,Arkusz1!$C:$C,0)),\"\",INDEX(Arkusz1!C:C,MATCH(ROW()-2,Arkusz1!$C:$C,0)))","v":36},{"$f":"IF(ISERROR(MATCH(ROW()-2,Arkusz1!$C:$C,0)),\"\",INDEX('import danych'!$A:$A,MATCH(ROW()-2,Arkusz1!$C:$C,0)+5))","v":"2012-10-30"},41212,{"$f":"IF(ISERROR(MATCH(ROW()-2,Arkusz1!$C:$C,0)),\"\",INDEX('import danych'!$B:$B,MATCH(ROW()-2,Arkusz1!$C:$C,0)+5))","v":"14:15"},{"$f":"IF(ISERROR(MATCH(ROW()-2,Arkusz1!$C:$C,0)),\"\",INDEX(Arkusz1!I:I,MATCH(ROW()-2,Arkusz1!$C:$C,0)))","v":{"$error":"#REF!"}},{"$f":"IF(ISERROR(MATCH(ROW()-2,Arkusz1!$C:$C,0)),\"\",INDEX('import danych'!$H:$H,MATCH(ROW()-2,Arkusz1!$C:$C,0)+5))","v":13834},{"$f":"IF(ISERROR(MATCH(ROW()-2,Arkusz1!$C:$C,0)),\"\",INDEX('import danych'!$L:$L,MATCH(ROW()-2,Arkusz1!$C:$C,0)+5))","v":36.84},null,null,{"$f":"IF(J37>$K$2-$K$1,\"\",J37+1)","v":32},{"$f":"IF($J38=\"\",\"\",LOOKUP($K$1+$J37,$A:$A,$B:$B))","v":"2012-10-26"},{"$f":"IF($J38=\"\",\"\",LOOKUP($K$1+$J37,$A:$A,$D:$D))","v":"18:39"},{"$f":"IF($J38=\"\",\"\",LOOKUP($K$1+$J37,$A:$A,$F:$F))","v":13803},{"$f":"IF($J38=\"\",\"\",LOOKUP($K$1+$J37,$A:$A,$G:$G))","v":48.36},32]
[{"$f":"IF(ISERROR(MATCH(ROW()-2,Arkusz1!$C:$C,0)),\"\",INDEX(Arkusz1!C:C,MATCH(ROW()-2,Arkusz1!$C:$C,0)))","v":37},{"$f":"IF(ISERROR(MATCH(ROW()-2,Arkusz1!$C:$C,0)),\"\",INDEX('import danych'!$A:$A,MATCH(ROW()-2,Arkusz1!$C:$C,0)+5))","v":"2012-10-31"},41213,{"$f":"IF(ISERROR(MATCH(ROW()-2,Arkusz1!$C:$C,0)),\"\",INDEX('import danych'!$B:$B,MATCH(ROW()-2,Arkusz1!$C:$C,0)+5))","v":"09:55"},{"$f":"IF(ISERROR(MATCH(ROW()-2,Arkusz1!$C:$C,0)),\"\",INDEX(Arkusz1!I:I,MATCH(ROW()-2,Arkusz1!$C:$C,0)))","v":{"$error":"#REF!"}},{"$f":"IF(ISERROR(MATCH(ROW()-2,Arkusz1!$C:$C,0)),\"\",INDEX('import danych'!$H:$H,MATCH(ROW()-2,Arkusz1!$C:$C,0)+5))","v":13851},{"$f":"IF(ISERROR(MATCH(ROW()-2,Arkusz1!$C:$C,0)),\"\",INDEX('import danych'!$L:$L,MATCH(ROW()-2,Arkusz1!$C:$C,0)+5))","v":52.18},null,null,33,"2012-10-28","12:45",13817,35.18,33]
[{"$f":"IF(ISERROR(MATCH(ROW()-2,Arkusz1!$C:$C,0)),\"\",INDEX(Arkusz1!C:C,MATCH(ROW()-2,Arkusz1!$C:$C,0)))","v":38},{"$f":"IF(ISERROR(MATCH(ROW()-2,Arkusz1!$C:$C,0)),\"\",INDEX('import danych'!$A:$A,MATCH(ROW()-2,Arkusz1!$C:$C,0)+5))","v":"2012-11-01"},41214,{"$f":"IF(ISERROR(MATCH(ROW()-2,Arkusz1!$C:$C,0)),\"\",INDEX('import danych'!$B:$B,MATCH(ROW()-2,Arkusz1!$C:$C,0)+5))","v":"14:06"},{"$f":"IF(ISERROR(MATCH(ROW()-2,Arkusz1!$C:$C,0)),\"\",INDEX(Arkusz1!I:I,MATCH(ROW()-2,Arkusz1!$C:$C,0)))","v":{"$error":"#REF!"}},{"$f":"IF(ISERROR(MATCH(ROW()-2,Arkusz1!$C:$C,0)),\"\",INDEX('import danych'!$H:$H,MATCH(ROW()-2,Arkusz1!$C:$C,0)+5))","v":13874},{"$f":"IF(ISERROR(MATCH(ROW()-2,Arkusz1!$C:$C,0)),\"\",INDEX('import danych'!$L:$L,MATCH(ROW()-2,Arkusz1!$C:$C,0)+5))","v":42.410000000000004},null,null,34,"2012-10-29","13:54",13823,19.78,34]
[{"$f":"IF(ISERROR(MATCH(ROW()-2,Arkusz1!$C:$C,0)),\"\",INDEX(Arkusz1!C:C,MATCH(ROW()-2,Arkusz1!$C:$C,0)))","v":""},{"$f":"IF(ISERROR(MATCH(ROW()-2,Arkusz1!$C:$C,0)),\"\",INDEX('import danych'!$A:$A,MATCH(ROW()-2,Arkusz1!$C:$C,0)+5))","v":""},"",{"$f":"IF(ISERROR(MATCH(ROW()-2,Arkusz1!$C:$C,0)),\"\",INDEX('import danych'!$B:$B,MATCH(ROW()-2,Arkusz1!$C:$C,0)+5))","v":""},{"$f":"IF(ISERROR(MATCH(ROW()-2,Arkusz1!$C:$C,0)),\"\",INDEX(Arkusz1!I:I,MATCH(ROW()-2,Arkusz1!$C:$C,0)))","v":""},{"$f":"IF(ISERROR(MATCH(ROW()-2,Arkusz1!$C:$C,0)),\"\",INDEX('import danych'!$H:$H,MATCH(ROW()-2,Arkusz1!$C:$C,0)+5))","v":""},{"$f":"IF(ISERROR(MATCH(ROW()-2,Arkusz1!$C:$C,0)),\"\",INDEX('import danych'!$L:$L,MATCH(ROW()-2,Arkusz1!$C:$C,0)+5))","v":""},null,null,{"$f":"IF(J40>$K$2-$K$1,\"\",J40+1)","v":35},{"$f":"IF($J41=\"\",\"\",LOOKUP($K$1+$J40,$A:$A,$B:$B))","v":"2012-10-30"},{"$f":"IF($J41=\"\",\"\",LOOKUP($K$1+$J40,$A:$A,$D:$D))","v":"14:15"},{"$f":"IF($J41=\"\",\"\",LOOKUP($K$1+$J40,$A:$A,$F:$F))","v":13834},{"$f":"IF($J41=\"\",\"\",LOOKUP($K$1+$J40,$A:$A,$G:$G))","v":36.84},35]
[{"$f":"IF(ISERROR(MATCH(ROW()-2,Arkusz1!$C:$C,0)),\"\",INDEX(Arkusz1!C:C,MATCH(ROW()-2,Arkusz1!$C:$C,0)))","v":""},{"$f":"IF(ISERROR(MATCH(ROW()-2,Arkusz1!$C:$C,0)),\"\",INDEX('import danych'!$A:$A,MATCH(ROW()-2,Arkusz1!$C:$C,0)+5))","v":""},"",{"$f":"IF(ISERROR(MATCH(ROW()-2,Arkusz1!$C:$C,0)),\"\",INDEX('import danych'!$B:$B,MATCH(ROW()-2,Arkusz1!$C:$C,0)+5))","v":""},{"$f":"IF(ISERROR(MATCH(ROW()-2,Arkusz1!$C:$C,0)),\"\",INDEX(Arkusz1!I:I,MATCH(ROW()-2,Arkusz1!$C:$C,0)))","v":""},{"$f":"IF(ISERROR(MATCH(ROW()-2,Arkusz1!$C:$C,0)),\"\",INDEX('import danych'!$H:$H,MATCH(ROW()-2,Arkusz1!$C:$C,0)+5))","v":""},{"$f":"IF(ISERROR(MATCH(ROW()-2,Arkusz1!$C:$C,0)),\"\",INDEX('import danych'!$L:$L,MATCH(ROW()-2,Arkusz1!$C:$C,0)+5))","v":""},null,null,36,"2012-10-31","09:55",13851,52.18,36]
[{"$f":"IF(ISERROR(MATCH(ROW()-2,Arkusz1!$C:$C,0)),\"\",INDEX(Arkusz1!C:C,MATCH(ROW()-2,Arkusz1!$C:$C,0)))","v":""},{"$f":"IF(ISERROR(MATCH(ROW()-2,Arkusz1!$C:$C,0)),\"\",INDEX('import danych'!$A:$A,MATCH(ROW()-2,Arkusz1!$C:$C,0)+5))","v":""},"",{"$f":"IF(ISERROR(MATCH(ROW()-2,Arkusz1!$C:$C,0)),\"\",INDEX('import danych'!$B:$B,MATCH(ROW()-2,Arkusz1!$C:$C,0)+5))","v":""},{"$f":"IF(ISERROR(MATCH(ROW()-2,Arkusz1!$C:$C,0)),\"\",INDEX(Arkusz1!I:I,MATCH(ROW()-2,Arkusz1!$C:$C,0)))","v":""},{"$f":"IF(ISERROR(MATCH(ROW()-2,Arkusz1!$C:$C,0)),\"\",INDEX('import danych'!$H:$H,MATCH(ROW()-2,Arkusz1!$C:$C,0)+5))","v":""},{"$f":"IF(ISERROR(MATCH(ROW()-2,Arkusz1!$C:$C,0)),\"\",INDEX('import danych'!$L:$L,MATCH(ROW()-2,Arkusz1!$C:$C,0)+5))","v":""},null,null,37,"2012-11-01","14:06",13874,42.410000000000004,37]
[{"$f":"IF(ISERROR(MATCH(ROW()-2,Arkusz1!$C:$C,0)),\"\",INDEX(Arkusz1!C:C,MATCH(ROW()-2,Arkusz1!$C:$C,0)))","v":""},{"$f":"IF(ISERROR(MATCH(ROW()-2,Arkusz1!$C:$C,0)),\"\",INDEX('import danych'!$A:$A,MATCH(ROW()-2,Arkusz1!$C:$C,0)+5))","v":""},"",{"$f":"IF(ISERROR(MATCH(ROW()-2,Arkusz1!$C:$C,0)),\"\",INDEX('import danych'!$B:$B,MATCH(ROW()-2,Arkusz1!$C:$C,0)+5))","v":""},{"$f":"IF(ISERROR(MATCH(ROW()-2,Arkusz1!$C:$C,0)),\"\",INDEX(Arkusz1!I:I,MATCH(ROW()-2,Arkusz1!$C:$C,0)))","v":""},{"$f":"IF(ISERROR(MATCH(ROW()-2,Arkusz1!$C:$C,0)),\"\",INDEX('import danych'!$H:$H,MATCH(ROW()-2,Arkusz1!$C:$C,0)+5))","v":""},{"$f":"IF(ISERROR(MATCH(ROW()-2,Arkusz1!$C:$C,0)),\"\",INDEX('import danych'!$L:$L,MATCH(ROW()-2,Arkusz1!$C:$C,0)+5))","v":""},null,null,"","","","","",{"$f":"IF($J44=\"\",\"\",LOOKUP($K$1+$J43,$A:$A,$E:$E))","v":""}]
[{"$f":"IF(ISERROR(MATCH(ROW()-2,Arkusz1!$C:$C,0)),\"\",INDEX(Arkusz1!C:C,MATCH(ROW()-2,Arkusz1!$C:$C,0)))","v":""},{"$f":"IF(ISERROR(MATCH(ROW()-2,Arkusz1!$C:$C,0)),\"\",INDEX('import danych'!$A:$A,MATCH(ROW()-2,Arkusz1!$C:$C,0)+5))","v":""},"",{"$f":"IF(ISERROR(MATCH(ROW()-2,Arkusz1!$C:$C,0)),\"\",INDEX('import danych'!$B:$B,MATCH(ROW()-2,Arkusz1!$C:$C,0)+5))","v":""},{"$f":"IF(ISERROR(MATCH(ROW()-2,Arkusz1!$C:$C,0)),\"\",INDEX(Arkusz1!I:I,MATCH(ROW()-2,Arkusz1!$C:$C,0)))","v":""},{"$f":"IF(ISERROR(MATCH(ROW()-2,Arkusz1!$C:$C,0)),\"\",INDEX('import danych'!$H:$H,MATCH(ROW()-2,Arkusz1!$C:$C,0)+5))","v":""},{"$f":"IF(ISERROR(MATCH(ROW()-2,Arkusz1!$C:$C,0)),\"\",INDEX('import danych'!$L:$L,MATCH(ROW()-2,Arkusz1!$C:$C,0)+5))","v":""},null,null,"","","","","",""]
[{"$f":"IF(ISERROR(MATCH(ROW()-2,Arkusz1!$C:$C,0)),\"\",INDEX(Arkusz1!C:C,MATCH(ROW()-2,Arkusz1!$C:$C,0)))","v":""},{"$f":"IF(ISERROR(MATCH(ROW()-2,Arkusz1!$C:$C,0)),\"\",INDEX('import danych'!$A:$A,MATCH(ROW()-2,Arkusz1!$C:$C,0)+5))","v":""},"",{"$f":"IF(ISERROR(MATCH(ROW()-2,Arkusz1!$C:$C,0)),\"\",INDEX('import danych'!$B:$B,MATCH(ROW()-2,Arkusz1!$C:$C,0)+5))","v":""},{"$f":"IF(ISERROR(MATCH(ROW()-2,Arkusz1!$C:$C,0)),\"\",INDEX(Arkusz1!I:I,MATCH(ROW()-2,Arkusz1!$C:$C,0)))","v":""},{"$f":"IF(ISERROR(MATCH(ROW()-2,Arkusz1!$C:$C,0)),\"\",INDEX('import danych'!$H:$H,MATCH(ROW()-2,Arkusz1!$C:$C,0)+5))","v":""},{"$f":"IF(ISERROR(MATCH(ROW()-2,Arkusz1!$C:$C,0)),\"\",INDEX('import danych'!$L:$L,MATCH(ROW()-2,Arkusz1!$C:$C,0)+5))","v":""},null,null,"","","","","",""]
[{"$f":"IF(ISERROR(MATCH(ROW()-2,Arkusz1!$C:$C,0)),\"\",INDEX(Arkusz1!C:C,MATCH(ROW()-2,Arkusz1!$C:$C,0)))","v":""},{"$f":"IF(ISERROR(MATCH(ROW()-2,Arkusz1!$C:$C,0)),\"\",INDEX('import danych'!$A:$A,MATCH(ROW()-2,Arkusz1!$C:$C,0)+5))","v":""},"",{"$f":"IF(ISERROR(MATCH(ROW()-2,Arkusz1!$C:$C,0)),\"\",INDEX('import danych'!$B:$B,MATCH(ROW()-2,Arkusz1!$C:$C,0)+5))","v":""},{"$f":"IF(ISERROR(MATCH(ROW()-2,Arkusz1!$C:$C,0)),\"\",INDEX(Arkusz1!I:I,MATCH(ROW()-2,Arkusz1!$C:$C,0)))","v":""},{"$f":"IF(ISERROR(MATCH(ROW()-2,Arkusz1!$C:$C,0)),\"\",INDEX('import danych'!$H:$H,MATCH(ROW()-2,Arkusz1!$C:$C,0)+5))","v":""},{"$f":"IF(ISERROR(MATCH(ROW()-2,Arkusz1!$C:$C,0)),\"\",INDEX('import danych'!$L:$L,MATCH(ROW()-2,Arkusz1!$C:$C,0)+5))","v":""},null,null,"","","","","",""]
[{"$f":"IF(ISERROR(MATCH(ROW()-2,Arkusz1!$C:$C,0)),\"\",INDEX(Arkusz1!C:C,MATCH(ROW()-2,Arkusz1!$C:$C,0)))","v":""},{"$f":"IF(ISERROR(MATCH(ROW()-2,Arkusz1!$C:$C,0)),\"\",INDEX('import danych'!$A:$A,MATCH(ROW()-2,Arkusz1!$C:$C,0)+5))","v":""},"",{"$f":"IF(ISERROR(MATCH(ROW()-2,Arkusz1!$C:$C,0)),\"\",INDEX('import danych'!$B:$B,MATCH(ROW()-2,Arkusz1!$C:$C,0)+5))","v":""},{"$f":"IF(ISERROR(MATCH(ROW()-2,Arkusz1!$C:$C,0)),\"\",INDEX(Arkusz1!I:I,MATCH(ROW()-2,Arkusz1!$C:$C,0)))","v":""},{"$f":"IF(ISERROR(MATCH(ROW()-2,Arkusz1!$C:$C,0)),\"\",INDEX('import danych'!$H:$H,MATCH(ROW()-2,Arkusz1!$C:$C,0)+5))","v":""},{"$f":"IF(ISERROR(MATCH(ROW()-2,Arkusz1!$C:$C,0)),\"\",INDEX('import danych'!$L:$L,MATCH(ROW()-2,Arkusz1!$C:$C,0)+5))","v":""},null,null,"","","","","",""]
[{"$f":"IF(ISERROR(MATCH(ROW()-2,Arkusz1!$C:$C,0)),\"\",INDEX(Arkusz1!C:C,MATCH(ROW()-2,Arkusz1!$C:$C,0)))","v":""},{"$f":"IF(ISERROR(MATCH(ROW()-2,Arkusz1!$C:$C,0)),\"\",INDEX('import danych'!$A:$A,MATCH(ROW()-2,Arkusz1!$C:$C,0)+5))","v":""},"",{"$f":"IF(ISERROR(MATCH(ROW()-2,Arkusz1!$C:$C,0)),\"\",INDEX('import danych'!$B:$B,MATCH(ROW()-2,Arkusz1!$C:$C,0)+5))","v":""},{"$f":"IF(ISERROR(MATCH(ROW()-2,Arkusz1!$C:$C,0)),\"\",INDEX(Arkusz1!I:I,MATCH(ROW()-2,Arkusz1!$C:$C,0)))","v":""},{"$f":"IF(ISERROR(MATCH(ROW()-2,Arkusz1!$C:$C,0)),\"\",INDEX('import danych'!$H:$H,MATCH(ROW()-2,Arkusz1!$C:$C,0)+5))","v":""},{"$f":"IF(ISERROR(MATCH(ROW()-2,Arkusz1!$C:$C,0)),\"\",INDEX('import danych'!$L:$L,MATCH(ROW()-2,Arkusz1!$C:$C,0)+5))","v":""},null,null,"","","","","",""]
[{"$f":"IF(ISERROR(MATCH(ROW()-2,Arkusz1!$C:$C,0)),\"\",INDEX(Arkusz1!C:C,MATCH(ROW()-2,Arkusz1!$C:$C,0)))","v":""},{"$f":"IF(ISERROR(MATCH(ROW()-2,Arkusz1!$C:$C,0)),\"\",INDEX('import danych'!$A:$A,MATCH(ROW()-2,Arkusz1!$C:$C,0)+5))","v":""},"",{"$f":"IF(ISERROR(MATCH(ROW()-2,Arkusz1!$C:$C,0)),\"\",INDEX('import danych'!$B:$B,MATCH(ROW()-2,Arkusz1!$C:$C,0)+5))","v":""},{"$f":"IF(ISERROR(MATCH(ROW()-2,Arkusz1!$C:$C,0)),\"\",INDEX(Arkusz1!I:I,MATCH(ROW()-2,Arkusz1!$C:$C,0)))","v":""},{"$f":"IF(ISERROR(MATCH(ROW()-2,Arkusz1!$C:$C,0)),\"\",INDEX('import danych'!$H:$H,MATCH(ROW()-2,Arkusz1!$C:$C,0)+5))","v":""},{"$f":"IF(ISERROR(MATCH(ROW()-2,Arkusz1!$C:$C,0)),\"\",INDEX('import danych'!$L:$L,MATCH(ROW()-2,Arkusz1!$C:$C,0)+5))","v":""},null,null,"","","","","",""]
[{"$f":"IF(ISERROR(MATCH(ROW()-2,Arkusz1!$C:$C,0)),\"\",INDEX(Arkusz1!C:C,MATCH(ROW()-2,Arkusz1!$C:$C,0)))","v":""},{"$f":"IF(ISERROR(MATCH(ROW()-2,Arkusz1!$C:$C,0)),\"\",INDEX('import danych'!$A:$A,MATCH(ROW()-2,Arkusz1!$C:$C,0)+5))","v":""},"",{"$f":"IF(ISERROR(MATCH(ROW()-2,Arkusz1!$C:$C,0)),\"\",INDEX('import danych'!$B:$B,MATCH(ROW()-2,Arkusz1!$C:$C,0)+5))","v":""},{"$f":"IF(ISERROR(MATCH(ROW()-2,Arkusz1!$C:$C,0)),\"\",INDEX(Arkusz1!I:I,MATCH(ROW()-2,Arkusz1!$C:$C,0)))","v":""},{"$f":"IF(ISERROR(MATCH(ROW()-2,Arkusz1!$C:$C,0)),\"\",INDEX('import danych'!$H:$H,MATCH(ROW()-2,Arkusz1!$C:$C,0)+5))","v":""},{"$f":"IF(ISERROR(MATCH(ROW()-2,Arkusz1!$C:$C,0)),\"\",INDEX('import danych'!$L:$L,MATCH(ROW()-2,Arkusz1!$C:$C,0)+5))","v":""},null,null,"","","","","",""]
[{"$f":"IF(ISERROR(MATCH(ROW()-2,Arkusz1!$C:$C,0)),\"\",INDEX(Arkusz1!C:C,MATCH(ROW()-2,Arkusz1!$C:$C,0)))","v":""},{"$f":"IF(ISERROR(MATCH(ROW()-2,Arkusz1!$C:$C,0)),\"\",INDEX('import danych'!$A:$A,MATCH(ROW()-2,Arkusz1!$C:$C,0)+5))","v":""},"",{"$f":"IF(ISERROR(MATCH(ROW()-2,Arkusz1!$C:$C,0)),\"\",INDEX('import danych'!$B:$B,MATCH(ROW()-2,Arkusz1!$C:$C,0)+5))","v":""},{"$f":"IF(ISERROR(MATCH(ROW()-2,Arkusz1!$C:$C,0)),\"\",INDEX(Arkusz1!I:I,MATCH(ROW()-2,Arkusz1!$C:$C,0)))","v":""},{"$f":"IF(ISERROR(MATCH(ROW()-2,Arkusz1!$C:$C,0)),\"\",INDEX('import danych'!$H:$H,MATCH(ROW()-2,Arkusz1!$C:$C,0)+5))","v":""},{"$f":"IF(ISERROR(MATCH(ROW()-2,Arkusz1!$C:$C,0)),\"\",INDEX('import danych'!$L:$L,MATCH(ROW()-2,Arkusz1!$C:$C,0)+5))","v":""},null,null,"","","","","",""]
[{"$f":"IF(ISERROR(MATCH(ROW()-2,Arkusz1!$C:$C,0)),\"\",INDEX(Arkusz1!C:C,MATCH(ROW()-2,Arkusz1!$C:$C,0)))","v":""},{"$f":"IF(ISERROR(MATCH(ROW()-2,Arkusz1!$C:$C,0)),\"\",INDEX('import danych'!$A:$A,MATCH(ROW()-2,Arkusz1!$C:$C,0)+5))","v":""},"",{"$f":"IF(ISERROR(MATCH(ROW()-2,Arkusz1!$C:$C,0)),\"\",INDEX('import danych'!$B:$B,MATCH(ROW()-2,Arkusz1!$C:$C,0)+5))","v":""},{"$f":"IF(ISERROR(MATCH(ROW()-2,Arkusz1!$C:$C,0)),\"\",INDEX(Arkusz1!I:I,MATCH(ROW()-2,Arkusz1!$C:$C,0)))","v":""},{"$f":"IF(ISERROR(MATCH(ROW()-2,Arkusz1!$C:$C,0)),\"\",INDEX('import danych'!$H:$H,MATCH(ROW()-2,Arkusz1!$C:$C,0)+5))","v":""},{"$f":"IF(ISERROR(MATCH(ROW()-2,Arkusz1!$C:$C,0)),\"\",INDEX('import danych'!$L:$L,MATCH(ROW()-2,Arkusz1!$C:$C,0)+5))","v":""},null,null,"","","","","",""]
[{"$f":"IF(ISERROR(MATCH(ROW()-2,Arkusz1!$C:$C,0)),\"\",INDEX(Arkusz1!C:C,MATCH(ROW()-2,Arkusz1!$C:$C,0)))","v":""},{"$f":"IF(ISERROR(MATCH(ROW()-2,Arkusz1!$C:$C,0)),\"\",INDEX('import danych'!$A:$A,MATCH(ROW()-2,Arkusz1!$C:$C,0)+5))","v":""},"",{"$f":"IF(ISERROR(MATCH(ROW()-2,Arkusz1!$C:$C,0)),\"\",INDEX('import danych'!$B:$B,MATCH(ROW()-2,Arkusz1!$C:$C,0)+5))","v":""},{"$f":"IF(ISERROR(MATCH(ROW()-2,Arkusz1!$C:$C,0)),\"\",INDEX(Arkusz1!I:I,MATCH(ROW()-2,Arkusz1!$C:$C,0)))","v":""},{"$f":"IF(ISERROR(MATCH(ROW()-2,Arkusz1!$C:$C,0)),\"\",INDEX('import danych'!$H:$H,MATCH(ROW()-2,Arkusz1!$C:$C,0)+5))","v":""},{"$f":"IF(ISERROR(MATCH(ROW()-2,Arkusz1!$C:$C,0)),\"\",INDEX('import danych'!$L:$L,MATCH(ROW()-2,Arkusz1!$C:$C,0)+5))","v":""},null,null,"","","","","",""]
[{"$f":"IF(ISERROR(MATCH(ROW()-2,Arkusz1!$C:$C,0)),\"\",INDEX(Arkusz1!C:C,MATCH(ROW()-2,Arkusz1!$C:$C,0)))","v":""},{"$f":"IF(ISERROR(MATCH(ROW()-2,Arkusz1!$C:$C,0)),\"\",INDEX('import danych'!$A:$A,MATCH(ROW()-2,Arkusz1!$C:$C,0)+5))","v":""},"",{"$f":"IF(ISERROR(MATCH(ROW()-2,Arkusz1!$C:$C,0)),\"\",INDEX('import danych'!$B:$B,MATCH(ROW()-2,Arkusz1!$C:$C,0)+5))","v":""},{"$f":"IF(ISERROR(MATCH(ROW()-2,Arkusz1!$C:$C,0)),\"\",INDEX(Arkusz1!I:I,MATCH(ROW()-2,Arkusz1!$C:$C,0)))","v":""},{"$f":"IF(ISERROR(MATCH(ROW()-2,Arkusz1!$C:$C,0)),\"\",INDEX('import danych'!$H:$H,MATCH(ROW()-2,Arkusz1!$C:$C,0)+5))","v":""},{"$f":"IF(ISERROR(MATCH(ROW()-2,Arkusz1!$C:$C,0)),\"\",INDEX('import danych'!$L:$L,MATCH(ROW()-2,Arkusz1!$C:$C,0)+5))","v":""},null,null,"","","","","",""]
[{"$f":"IF(ISERROR(MATCH(ROW()-2,Arkusz1!$C:$C,0)),\"\",INDEX(Arkusz1!C:C,MATCH(ROW()-2,Arkusz1!$C:$C,0)))","v":""},{"$f":"IF(ISERROR(MATCH(ROW()-2,Arkusz1!$C:$C,0)),\"\",INDEX('import danych'!$A:$A,MATCH(ROW()-2,Arkusz1!$C:$C,0)+5))","v":""},"",{"$f":"IF(ISERROR(MATCH(ROW()-2,Arkusz1!$C:$C,0)),\"\",INDEX('import danych'!$B:$B,MATCH(ROW()-2,Arkusz1!$C:$C,0)+5))","v":""},{"$f":"IF(ISERROR(MATCH(ROW()-2,Arkusz1!$C:$C,0)),\"\",INDEX(Arkusz1!I:I,MATCH(ROW()-2,Arkusz1!$C:$C,0)))","v":""},{"$f":"IF(ISERROR(MATCH(ROW()-2,Arkusz1!$C:$C,0)),\"\",INDEX('import danych'!$H:$H,MATCH(ROW()-2,Arkusz1!$C:$C,0)+5))","v":""},{"$f":"IF(ISERROR(MATCH(ROW()-2,Arkusz1!$C:$C,0)),\"\",INDEX('import danych'!$L:$L,MATCH(ROW()-2,Arkusz1!$C:$C,0)+5))","v":""},null,null,"","","","","",""]
[{"$f":"IF(ISERROR(MATCH(ROW()-2,Arkusz1!$C:$C,0)),\"\",INDEX(Arkusz1!C:C,MATCH(ROW()-2,Arkusz1!$C:$C,0)))","v":""},{"$f":"IF(ISERROR(MATCH(ROW()-2,Arkusz1!$C:$C,0)),\"\",INDEX('import danych'!$A:$A,MATCH(ROW()-2,Arkusz1!$C:$C,0)+5))","v":""},"",{"$f":"IF(ISERROR(MATCH(ROW()-2,Arkusz1!$C:$C,0)),\"\",INDEX('import danych'!$B:$B,MATCH(ROW()-2,Arkusz1!$C:$C,0)+5))","v":""},{"$f":"IF(ISERROR(MATCH(ROW()-2,Arkusz1!$C:$C,0)),\"\",INDEX(Arkusz1!I:I,MATCH(ROW()-2,Arkusz1!$C:$C,0)))","v":""},{"$f":"IF(ISERROR(MATCH(ROW()-2,Arkusz1!$C:$C,0)),\"\",INDEX('import danych'!$H:$H,MATCH(ROW()-2,Arkusz1!$C:$C,0)+5))","v":""},{"$f":"IF(ISERROR(MATCH(ROW()-2,Arkusz1!$C:$C,0)),\"\",INDEX('import danych'!$L:$L,MATCH(ROW()-2,Arkusz1!$C:$C,0)+5))","v":""},null,null,"","","","","",""]
[{"$f":"IF(ISERROR(MATCH(ROW()-2,Arkusz1!$C:$C,0)),\"\",INDEX(Arkusz1!C:C,MATCH(ROW()-2,Arkusz1!$C:$C,0)))","v":""},{"$f":"IF(ISERROR(MATCH(ROW()-2,Arkusz1!$C:$C,0)),\"\",INDEX('import danych'!$A:$A,MATCH(ROW()-2,Arkusz1!$C:$C,0)+5))","v":""},"",{"$f":"IF(ISERROR(MATCH(ROW()-2,Arkusz1!$C:$C,0)),\"\",INDEX('import danych'!$B:$B,MATCH(ROW()-2,Arkusz1!$C:$C,0)+5))","v":""},{"$f":"IF(ISERROR(MATCH(ROW()-2,Arkusz1!$C:$C,0)),\"\",INDEX(Arkusz1!I:I,MATCH(ROW()-2,Arkusz1!$C:$C,0)))","v":""},{"$f":"IF(ISERROR(MATCH(ROW()-2,Arkusz1!$C:$C,0)),\"\",INDEX('import danych'!$H:$H,MATCH(ROW()-2,Arkusz1!$C:$C,0)+5))","v":""},{"$f":"IF(ISERROR(MATCH(ROW()-2,Arkusz1!$C:$C,0)),\"\",INDEX('import danych'!$L:$L,MATCH(ROW()-2,Arkusz1!$C:$C,0)+5))","v":""},null,null,"","","","","",""]
[{"$f":"IF(ISERROR(MATCH(ROW()-2,Arkusz1!$C:$C,0)),\"\",INDEX(Arkusz1!C:C,MATCH(ROW()-2,Arkusz1!$C:$C,0)))","v":""},{"$f":"IF(ISERROR(MATCH(ROW()-2,Arkusz1!$C:$C,0)),\"\",INDEX('import danych'!$A:$A,MATCH(ROW()-2,Arkusz1!$C:$C,0)+5))","v":""},"",{"$f":"IF(ISERROR(MATCH(ROW()-2,Arkusz1!$C:$C,0)),\"\",INDEX('import danych'!$B:$B,MATCH(ROW()-2,Arkusz1!$C:$C,0)+5))","v":""},{"$f":"IF(ISERROR(MATCH(ROW()-2,Arkusz1!$C:$C,0)),\"\",INDEX(Arkusz1!I:I,MATCH(ROW()-2,Arkusz1!$C:$C,0)))","v":""},{"$f":"IF(ISERROR(MATCH(ROW()-2,Arkusz1!$C:$C,0)),\"\",INDEX('import danych'!$H:$H,MATCH(ROW()-2,Arkusz1!$C:$C,0)+5))","v":""},{"$f":"IF(ISERROR(MATCH(ROW()-2,Arkusz1!$C:$C,0)),\"\",INDEX('import danych'!$L:$L,MATCH(ROW()-2,Arkusz1!$C:$C,0)+5))","v":""},null,null,"","","","","",""]
[{"$f":"IF(ISERROR(MATCH(ROW()-2,Arkusz1!$C:$C,0)),\"\",INDEX(Arkusz1!C:C,MATCH(ROW()-2,Arkusz1!$C:$C,0)))","v":""},{"$f":"IF(ISERROR(MATCH(ROW()-2,Arkusz1!$C:$C,0)),\"\",INDEX('import danych'!$A:$A,MATCH(ROW()-2,Arkusz1!$C:$C,0)+5))","v":""},"",{"$f":"IF(ISERROR(MATCH(ROW()-2,Arkusz1!$C:$C,0)),\"\",INDEX('import danych'!$B:$B,MATCH(ROW()-2,Arkusz1!$C:$C,0)+5))","v":""},{"$f":"IF(ISERROR(MATCH(ROW()-2,Arkusz1!$C:$C,0)),\"\",INDEX(Arkusz1!I:I,MATCH(ROW()-2,Arkusz1!$C:$C,0)))","v":""},{"$f":"IF(ISERROR(MATCH(ROW()-2,Arkusz1!$C:$C,0)),\"\",INDEX('import danych'!$H:$H,MATCH(ROW()-2,Arkusz1!$C:$C,0)+5))","v":""},{"$f":"IF(ISERROR(MATCH(ROW()-2,Arkusz1!$C:$C,0)),\"\",INDEX('import danych'!$L:$L,MATCH(ROW()-2,Arkusz1!$C:$C,0)+5))","v":""},null,null,"","","","","",""]
[{"$f":"IF(ISERROR(MATCH(ROW()-2,Arkusz1!$C:$C,0)),\"\",INDEX(Arkusz1!C:C,MATCH(ROW()-2,Arkusz1!$C:$C,0)))","v":""},{"$f":"IF(ISERROR(MATCH(ROW()-2,Arkusz1!$C:$C,0)),\"\",INDEX('import danych'!$A:$A,MATCH(ROW()-2,Arkusz1!$C:$C,0)+5))","v":""},"",{"$f":"IF(ISERROR(MATCH(ROW()-2,Arkusz1!$C:$C,0)),\"\",INDEX('import danych'!$B:$B,MATCH(ROW()-2,Arkusz1!$C:$C,0)+5))","v":""},{"$f":"IF(ISERROR(MATCH(ROW()-2,Arkusz1!$C:$C,0)),\"\",INDEX(Arkusz1!I:I,MATCH(ROW()-2,Arkusz1!$C:$C,0)))","v":""},{"$f":"IF(ISERROR(MATCH(ROW()-2,Arkusz1!$C:$C,0)),\"\",INDEX('import danych'!$H:$H,MATCH(ROW()-2,Arkusz1!$C:$C,0)+5))","v":""},{"$f":"IF(ISERROR(MATCH(ROW()-2,Arkusz1!$C:$C,0)),\"\",INDEX('import danych'!$L:$L,MATCH(ROW()-2,Arkusz1!$C:$C,0)+5))","v":""},null,null,"","","","","",""]
[{"$f":"IF(ISERROR(MATCH(ROW()-2,Arkusz1!$C:$C,0)),\"\",INDEX(Arkusz1!C:C,MATCH(ROW()-2,Arkusz1!$C:$C,0)))","v":""},{"$f":"IF(ISERROR(MATCH(ROW()-2,Arkusz1!$C:$C,0)),\"\",INDEX('import danych'!$A:$A,MATCH(ROW()-2,Arkusz1!$C:$C,0)+5))","v":""},"",{"$f":"IF(ISERROR(MATCH(ROW()-2,Arkusz1!$C:$C,0)),\"\",INDEX('import danych'!$B:$B,MATCH(ROW()-2,Arkusz1!$C:$C,0)+5))","v":""},{"$f":"IF(ISERROR(MATCH(ROW()-2,Arkusz1!$C:$C,0)),\"\",INDEX(Arkusz1!I:I,MATCH(ROW()-2,Arkusz1!$C:$C,0)))","v":""},{"$f":"IF(ISERROR(MATCH(ROW()-2,Arkusz1!$C:$C,0)),\"\",INDEX('import danych'!$H:$H,MATCH(ROW()-2,Arkusz1!$C:$C,0)+5))","v":""},{"$f":"IF(ISERROR(MATCH(ROW()-2,Arkusz1!$C:$C,0)),\"\",INDEX('import danych'!$L:$L,MATCH(ROW()-2,Arkusz1!$C:$C,0)+5))","v":""},null,null,"","","","","",""]
[{"$f":"IF(ISERROR(MATCH(ROW()-2,Arkusz1!$C:$C,0)),\"\",INDEX(Arkusz1!C:C,MATCH(ROW()-2,Arkusz1!$C:$C,0)))","v":""},{"$f":"IF(ISERROR(MATCH(ROW()-2,Arkusz1!$C:$C,0)),\"\",INDEX('import danych'!$A:$A,MATCH(ROW()-2,Arkusz1!$C:$C,0)+5))","v":""},"",{"$f":"IF(ISERROR(MATCH(ROW()-2,Arkusz1!$C:$C,0)),\"\",INDEX('import danych'!$B:$B,MATCH(ROW()-2,Arkusz1!$C:$C,0)+5))","v":""},{"$f":"IF(ISERROR(MATCH(ROW()-2,Arkusz1!$C:$C,0)),\"\",INDEX(Arkusz1!I:I,MATCH(ROW()-2,Arkusz1!$C:$C,0)))","v":""},{"$f":"IF(ISERROR(MATCH(ROW()-2,Arkusz1!$C:$C,0)),\"\",INDEX('import danych'!$H:$H,MATCH(ROW()-2,Arkusz1!$C:$C,0)+5))","v":""},{"$f":"IF(ISERROR(MATCH(ROW()-2,Arkusz1!$C:$C,0)),\"\",INDEX('import danych'!$L:$L,MATCH(ROW()-2,Arkusz1!$C:$C,0)+5))","v":""}]
[{"$f":"IF(ISERROR(MATCH(ROW()-2,Arkusz1!$C:$C,0)),\"\",INDEX(Arkusz1!C:C,MATCH(ROW()-2,Arkusz1!$C:$C,0)))","v":""},{"$f":"IF(ISERROR(MATCH(ROW()-2,Arkusz1!$C:$C,0)),\"\",INDEX('import danych'!$A:$A,MATCH(ROW()-2,Arkusz1!$C:$C,0)+5))","v":""},"",{"$f":"IF(ISERROR(MATCH(ROW()-2,Arkusz1!$C:$C,0)),\"\",INDEX('import danych'!$B:$B,MATCH(ROW()-2,Arkusz1!$C:$C,0)+5))","v":""},{"$f":"IF(ISERROR(MATCH(ROW()-2,Arkusz1!$C:$C,0)),\"\",INDEX(Arkusz1!I:I,MATCH(ROW()-2,Arkusz1!$C:$C,0)))","v":""},{"$f":"IF(ISERROR(MATCH(ROW()-2,Arkusz1!$C:$C,0)),\"\",INDEX('import danych'!$H:$H,MATCH(ROW()-2,Arkusz1!$C:$C,0)+5))","v":""},{"$f":"IF(ISERROR(MATCH(ROW()-2,Arkusz1!$C:$C,0)),\"\",INDEX('import danych'!$L:$L,MATCH(ROW()-2,Arkusz1!$C:$C,0)+5))","v":""}]
[{"$f":"IF(ISERROR(MATCH(ROW()-2,Arkusz1!$C:$C,0)),\"\",INDEX(Arkusz1!C:C,MATCH(ROW()-2,Arkusz1!$C:$C,0)))","v":""},{"$f":"IF(ISERROR(MATCH(ROW()-2,Arkusz1!$C:$C,0)),\"\",INDEX('import danych'!$A:$A,MATCH(ROW()-2,Arkusz1!$C:$C,0)+5))","v":""},"",{"$f":"IF(ISERROR(MATCH(ROW()-2,Arkusz1!$C:$C,0)),\"\",INDEX('import danych'!$B:$B,MATCH(ROW()-2,Arkusz1!$C:$C,0)+5))","v":""},{"$f":"IF(ISERROR(MATCH(ROW()-2,Arkusz1!$C:$C,0)),\"\",INDEX(Arkusz1!I:I,MATCH(ROW()-2,Arkusz1!$C:$C,0)))","v":""},{"$f":"IF(ISERROR(MATCH(ROW()-2,Arkusz1!$C:$C,0)),\"\",INDEX('import danych'!$H:$H,MATCH(ROW()-2,Arkusz1!$C:$C,0)+5))","v":""},{"$f":"IF(ISERROR(MATCH(ROW()-2,Arkusz1!$C:$C,0)),\"\",INDEX('import danych'!$L:$L,MATCH(ROW()-2,Arkusz1!$C:$C,0)+5))","v":""}]
[{"$f":"IF(ISERROR(MATCH(ROW()-2,Arkusz1!$C:$C,0)),\"\",INDEX(Arkusz1!C:C,MATCH(ROW()-2,Arkusz1!$C:$C,0)))","v":""},{"$f":"IF(ISERROR(MATCH(ROW()-2,Arkusz1!$C:$C,0)),\"\",INDEX('import danych'!$A:$A,MATCH(ROW()-2,Arkusz1!$C:$C,0)+5))","v":""},"",{"$f":"IF(ISERROR(MATCH(ROW()-2,Arkusz1!$C:$C,0)),\"\",INDEX('import danych'!$B:$B,MATCH(ROW()-2,Arkusz1!$C:$C,0)+5))","v":""},{"$f":"IF(ISERROR(MATCH(ROW()-2,Arkusz1!$C:$C,0)),\"\",INDEX(Arkusz1!I:I,MATCH(ROW()-2,Arkusz1!$C:$C,0)))","v":""},{"$f":"IF(ISERROR(MATCH(ROW()-2,Arkusz1!$C:$C,0)),\"\",INDEX('import danych'!$H:$H,MATCH(ROW()-2,Arkusz1!$C:$C,0)+5))","v":""},{"$f":"IF(ISERROR(MATCH(ROW()-2,Arkusz1!$C:$C,0)),\"\",INDEX('import danych'!$L:$L,MATCH(ROW()-2,Arkusz1!$C:$C,0)+5))","v":""}]
[{"$f":"IF(ISERROR(MATCH(ROW()-2,Arkusz1!$C:$C,0)),\"\",INDEX(Arkusz1!C:C,MATCH(ROW()-2,Arkusz1!$C:$C,0)))","v":""},{"$f":"IF(ISERROR(MATCH(ROW()-2,Arkusz1!$C:$C,0)),\"\",INDEX('import danych'!$A:$A,MATCH(ROW()-2,Arkusz1!$C:$C,0)+5))","v":""},"",{"$f":"IF(ISERROR(MATCH(ROW()-2,Arkusz1!$C:$C,0)),\"\",INDEX('import danych'!$B:$B,MATCH(ROW()-2,Arkusz1!$C:$C,0)+5))","v":""},{"$f":"IF(ISERROR(MATCH(ROW()-2,Arkusz1!$C:$C,0)),\"\",INDEX(Arkusz1!I:I,MATCH(ROW()-2,Arkusz1!$C:$C,0)))","v":""},{"$f":"IF(ISERROR(MATCH(ROW()-2,Arkusz1!$C:$C,0)),\"\",INDEX('import danych'!$H:$H,MATCH(ROW()-2,Arkusz1!$C:$C,0)+5))","v":""},{"$f":"IF(ISERROR(MATCH(ROW()-2,Arkusz1!$C:$C,0)),\"\",INDEX('import danych'!$L:$L,MATCH(ROW()-2,Arkusz1!$C:$C,0)+5))","v":""}]
[{"$f":"IF(ISERROR(MATCH(ROW()-2,Arkusz1!$C:$C,0)),\"\",INDEX(Arkusz1!C:C,MATCH(ROW()-2,Arkusz1!$C:$C,0)))","v":""},{"$f":"IF(ISERROR(MATCH(ROW()-2,Arkusz1!$C:$C,0)),\"\",INDEX('import danych'!$A:$A,MATCH(ROW()-2,Arkusz1!$C:$C,0)+5))","v":""},{"$f":"IF(A68=\"\",\"\",DATEVALUE(B68))","v":""},{"$f":"IF(ISERROR(MATCH(ROW()-2,Arkusz1!$C:$C,0)),\"\",INDEX('import danych'!$B:$B,MATCH(ROW()-2,Arkusz1!$C:$C,0)+5))","v":""},{"$f":"IF(ISERROR(MATCH(ROW()-2,Arkusz1!$C:$C,0)),\"\",INDEX(Arkusz1!I:I,MATCH(ROW()-2,Arkusz1!$C:$C,0)))","v":""},{"$f":"IF(ISERROR(MATCH(ROW()-2,Arkusz1!$C:$C,0)),\"\",INDEX('import danych'!$H:$H,MATCH(ROW()-2,Arkusz1!$C:$C,0)+5))","v":""},{"$f":"IF(ISERROR(MATCH(ROW()-2,Arkusz1!$C:$C,0)),\"\",INDEX('import danych'!$L:$L,MATCH(ROW()-2,Arkusz1!$C:$C,0)+5))","v":""}]
[{"$f":"IF(ISERROR(MATCH(ROW()-2,Arkusz1!$C:$C,0)),\"\",INDEX(Arkusz1!C:C,MATCH(ROW()-2,Arkusz1!$C:$C,0)))","v":""},{"$f":"IF(ISERROR(MATCH(ROW()-2,Arkusz1!$C:$C,0)),\"\",INDEX('import danych'!$A:$A,MATCH(ROW()-2,Arkusz1!$C:$C,0)+5))","v":""},"",{"$f":"IF(ISERROR(MATCH(ROW()-2,Arkusz1!$C:$C,0)),\"\",INDEX('import danych'!$B:$B,MATCH(ROW()-2,Arkusz1!$C:$C,0)+5))","v":""},{"$f":"IF(ISERROR(MATCH(ROW()-2,Arkusz1!$C:$C,0)),\"\",INDEX(Arkusz1!I:I,MATCH(ROW()-2,Arkusz1!$C:$C,0)))","v":""},{"$f":"IF(ISERROR(MATCH(ROW()-2,Arkusz1!$C:$C,0)),\"\",INDEX('import danych'!$H:$H,MATCH(ROW()-2,Arkusz1!$C:$C,0)+5))","v":""},{"$f":"IF(ISERROR(MATCH(ROW()-2,Arkusz1!$C:$C,0)),\"\",INDEX('import danych'!$L:$L,MATCH(ROW()-2,Arkusz1!$C:$C,0)+5))","v":""}]
[{"$f":"IF(ISERROR(MATCH(ROW()-2,Arkusz1!$C:$C,0)),\"\",INDEX(Arkusz1!C:C,MATCH(ROW()-2,Arkusz1!$C:$C,0)))","v":""},{"$f":"IF(ISERROR(MATCH(ROW()-2,Arkusz1!$C:$C,0)),\"\",INDEX('import danych'!$A:$A,MATCH(ROW()-2,Arkusz1!$C:$C,0)+5))","v":""},"",{"$f":"IF(ISERROR(MATCH(ROW()-2,Arkusz1!$C:$C,0)),\"\",INDEX('import danych'!$B:$B,MATCH(ROW()-2,Arkusz1!$C:$C,0)+5))","v":""},{"$f":"IF(ISERROR(MATCH(ROW()-2,Arkusz1!$C:$C,0)),\"\",INDEX(Arkusz1!I:I,MATCH(ROW()-2,Arkusz1!$C:$C,0)))","v":""},{"$f":"IF(ISERROR(MATCH(ROW()-2,Arkusz1!$C:$C,0)),\"\",INDEX('import danych'!$H:$H,MATCH(ROW()-2,Arkusz1!$C:$C,0)+5))","v":""},{"$f":"IF(ISERROR(MATCH(ROW()-2,Arkusz1!$C:$C,0)),\"\",INDEX('import danych'!$L:$L,MATCH(ROW()-2,Arkusz1!$C:$C,0)+5))","v":""}]
[{"$f":"IF(ISERROR(MATCH(ROW()-2,Arkusz1!$C:$C,0)),\"\",INDEX(Arkusz1!C:C,MATCH(ROW()-2,Arkusz1!$C:$C,0)))","v":""},{"$f":"IF(ISERROR(MATCH(ROW()-2,Arkusz1!$C:$C,0)),\"\",INDEX('import danych'!$A:$A,MATCH(ROW()-2,Arkusz1!$C:$C,0)+5))","v":""},"",{"$f":"IF(ISERROR(MATCH(ROW()-2,Arkusz1!$C:$C,0)),\"\",INDEX('import danych'!$B:$B,MATCH(ROW()-2,Arkusz1!$C:$C,0)+5))","v":""},{"$f":"IF(ISERROR(MATCH(ROW()-2,Arkusz1!$C:$C,0)),\"\",INDEX(Arkusz1!I:I,MATCH(ROW()-2,Arkusz1!$C:$C,0)))","v":""},{"$f":"IF(ISERROR(MATCH(ROW()-2,Arkusz1!$C:$C,0)),\"\",INDEX('import danych'!$H:$H,MATCH(ROW()-2,Arkusz1!$C:$C,0)+5))","v":""},{"$f":"IF(ISERROR(MATCH(ROW()-2,Arkusz1!$C:$C,0)),\"\",INDEX('import danych'!$L:$L,MATCH(ROW()-2,Arkusz1!$C:$C,0)+5))","v":""}]
[{"$f":"IF(ISERROR(MATCH(ROW()-2,Arkusz1!$C:$C,0)),\"\",INDEX(Arkusz1!C:C,MATCH(ROW()-2,Arkusz1!$C:$C,0)))","v":""},{"$f":"IF(ISERROR(MATCH(ROW()-2,Arkusz1!$C:$C,0)),\"\",INDEX('import danych'!$A:$A,MATCH(ROW()-2,Arkusz1!$C:$C,0)+5))","v":""},"",{"$f":"IF(ISERROR(MATCH(ROW()-2,Arkusz1!$C:$C,0)),\"\",INDEX('import danych'!$B:$B,MATCH(ROW()-2,Arkusz1!$C:$C,0)+5))","v":""},{"$f":"IF(ISERROR(MATCH(ROW()-2,Arkusz1!$C:$C,0)),\"\",INDEX(Arkusz1!I:I,MATCH(ROW()-2,Arkusz1!$C:$C,0)))","v":""},{"$f":"IF(ISERROR(MATCH(ROW()-2,Arkusz1!$C:$C,0)),\"\",INDEX('import danych'!$H:$H,MATCH(ROW()-2,Arkusz1!$C:$C,0)+5))","v":""},{"$f":"IF(ISERROR(MATCH(ROW()-2,Arkusz1!$C:$C,0)),\"\",INDEX('import danych'!$L:$L,MATCH(ROW()-2,Arkusz1!$C:$C,0)+5))","v":""}]
[{"$f":"IF(ISERROR(MATCH(ROW()-2,Arkusz1!$C:$C,0)),\"\",INDEX(Arkusz1!C:C,MATCH(ROW()-2,Arkusz1!$C:$C,0)))","v":""},{"$f":"IF(ISERROR(MATCH(ROW()-2,Arkusz1!$C:$C,0)),\"\",INDEX('import danych'!$A:$A,MATCH(ROW()-2,Arkusz1!$C:$C,0)+5))","v":""},"",{"$f":"IF(ISERROR(MATCH(ROW()-2,Arkusz1!$C:$C,0)),\"\",INDEX('import danych'!$B:$B,MATCH(ROW()-2,Arkusz1!$C:$C,0)+5))","v":""},{"$f":"IF(ISERROR(MATCH(ROW()-2,Arkusz1!$C:$C,0)),\"\",INDEX(Arkusz1!I:I,MATCH(ROW()-2,Arkusz1!$C:$C,0)))","v":""},{"$f":"IF(ISERROR(MATCH(ROW()-2,Arkusz1!$C:$C,0)),\"\",INDEX('import danych'!$H:$H,MATCH(ROW()-2,Arkusz1!$C:$C,0)+5))","v":""},{"$f":"IF(ISERROR(MATCH(ROW()-2,Arkusz1!$C:$C,0)),\"\",INDEX('import danych'!$L:$L,MATCH(ROW()-2,Arkusz1!$C:$C,0)+5))","v":""}]
[{"$f":"IF(ISERROR(MATCH(ROW()-2,Arkusz1!$C:$C,0)),\"\",INDEX(Arkusz1!C:C,MATCH(ROW()-2,Arkusz1!$C:$C,0)))","v":""},{"$f":"IF(ISERROR(MATCH(ROW()-2,Arkusz1!$C:$C,0)),\"\",INDEX('import danych'!$A:$A,MATCH(ROW()-2,Arkusz1!$C:$C,0)+5))","v":""},"",{"$f":"IF(ISERROR(MATCH(ROW()-2,Arkusz1!$C:$C,0)),\"\",INDEX('import danych'!$B:$B,MATCH(ROW()-2,Arkusz1!$C:$C,0)+5))","v":""},{"$f":"IF(ISERROR(MATCH(ROW()-2,Arkusz1!$C:$C,0)),\"\",INDEX(Arkusz1!I:I,MATCH(ROW()-2,Arkusz1!$C:$C,0)))","v":""},{"$f":"IF(ISERROR(MATCH(ROW()-2,Arkusz1!$C:$C,0)),\"\",INDEX('import danych'!$H:$H,MATCH(ROW()-2,Arkusz1!$C:$C,0)+5))","v":""},{"$f":"IF(ISERROR(MATCH(ROW()-2,Arkusz1!$C:$C,0)),\"\",INDEX('import danych'!$L:$L,MATCH(ROW()-2,Arkusz1!$C:$C,0)+5))","v":""}]
[{"$f":"IF(ISERROR(MATCH(ROW()-2,Arkusz1!$C:$C,0)),\"\",INDEX(Arkusz1!C:C,MATCH(ROW()-2,Arkusz1!$C:$C,0)))","v":""},{"$f":"IF(ISERROR(MATCH(ROW()-2,Arkusz1!$C:$C,0)),\"\",INDEX('import danych'!$A:$A,MATCH(ROW()-2,Arkusz1!$C:$C,0)+5))","v":""},"",{"$f":"IF(ISERROR(MATCH(ROW()-2,Arkusz1!$C:$C,0)),\"\",INDEX('import danych'!$B:$B,MATCH(ROW()-2,Arkusz1!$C:$C,0)+5))","v":""},{"$f":"IF(ISERROR(MATCH(ROW()-2,Arkusz1!$C:$C,0)),\"\",INDEX(Arkusz1!I:I,MATCH(ROW()-2,Arkusz1!$C:$C,0)))","v":""},{"$f":"IF(ISERROR(MATCH(ROW()-2,Arkusz1!$C:$C,0)),\"\",INDEX('import danych'!$H:$H,MATCH(ROW()-2,Arkusz1!$C:$C,0)+5))","v":""},{"$f":"IF(ISERROR(MATCH(ROW()-2,Arkusz1!$C:$C,0)),\"\",INDEX('import danych'!$L:$L,MATCH(ROW()-2,Arkusz1!$C:$C,0)+5))","v":""}]
[{"$f":"IF(ISERROR(MATCH(ROW()-2,Arkusz1!$C:$C,0)),\"\",INDEX(Arkusz1!C:C,MATCH(ROW()-2,Arkusz1!$C:$C,0)))","v":""},{"$f":"IF(ISERROR(MATCH(ROW()-2,Arkusz1!$C:$C,0)),\"\",INDEX('import danych'!$A:$A,MATCH(ROW()-2,Arkusz1!$C:$C,0)+5))","v":""},"",{"$f":"IF(ISERROR(MATCH(ROW()-2,Arkusz1!$C:$C,0)),\"\",INDEX('import danych'!$B:$B,MATCH(ROW()-2,Arkusz1!$C:$C,0)+5))","v":""},{"$f":"IF(ISERROR(MATCH(ROW()-2,Arkusz1!$C:$C,0)),\"\",INDEX(Arkusz1!I:I,MATCH(ROW()-2,Arkusz1!$C:$C,0)))","v":""},{"$f":"IF(ISERROR(MATCH(ROW()-2,Arkusz1!$C:$C,0)),\"\",INDEX('import danych'!$H:$H,MATCH(ROW()-2,Arkusz1!$C:$C,0)+5))","v":""},{"$f":"IF(ISERROR(MATCH(ROW()-2,Arkusz1!$C:$C,0)),\"\",INDEX('import danych'!$L:$L,MATCH(ROW()-2,Arkusz1!$C:$C,0)+5))","v":""}]
[{"$f":"IF(ISERROR(MATCH(ROW()-2,Arkusz1!$C:$C,0)),\"\",INDEX(Arkusz1!C:C,MATCH(ROW()-2,Arkusz1!$C:$C,0)))","v":""},{"$f":"IF(ISERROR(MATCH(ROW()-2,Arkusz1!$C:$C,0)),\"\",INDEX('import danych'!$A:$A,MATCH(ROW()-2,Arkusz1!$C:$C,0)+5))","v":""},"",{"$f":"IF(ISERROR(MATCH(ROW()-2,Arkusz1!$C:$C,0)),\"\",INDEX('import danych'!$B:$B,MATCH(ROW()-2,Arkusz1!$C:$C,0)+5))","v":""},{"$f":"IF(ISERROR(MATCH(ROW()-2,Arkusz1!$C:$C,0)),\"\",INDEX(Arkusz1!I:I,MATCH(ROW()-2,Arkusz1!$C:$C,0)))","v":""},{"$f":"IF(ISERROR(MATCH(ROW()-2,Arkusz1!$C:$C,0)),\"\",INDEX('import danych'!$H:$H,MATCH(ROW()-2,Arkusz1!$C:$C,0)+5))","v":""},{"$f":"IF(ISERROR(MATCH(ROW()-2,Arkusz1!$C:$C,0)),\"\",INDEX('import danych'!$L:$L,MATCH(ROW()-2,Arkusz1!$C:$C,0)+5))","v":""}]
[{"$f":"IF(ISERROR(MATCH(ROW()-2,Arkusz1!$C:$C,0)),\"\",INDEX(Arkusz1!C:C,MATCH(ROW()-2,Arkusz1!$C:$C,0)))","v":""},{"$f":"IF(ISERROR(MATCH(ROW()-2,Arkusz1!$C:$C,0)),\"\",INDEX('import danych'!$A:$A,MATCH(ROW()-2,Arkusz1!$C:$C,0)+5))","v":""},"",{"$f":"IF(ISERROR(MATCH(ROW()-2,Arkusz1!$C:$C,0)),\"\",INDEX('import danych'!$B:$B,MATCH(ROW()-2,Arkusz1!$C:$C,0)+5))","v":""},{"$f":"IF(ISERROR(MATCH(ROW()-2,Arkusz1!$C:$C,0)),\"\",INDEX(Arkusz1!I:I,MATCH(ROW()-2,Arkusz1!$C:$C,0)))","v":""},{"$f":"IF(ISERROR(MATCH(ROW()-2,Arkusz1!$C:$C,0)),\"\",INDEX('import danych'!$H:$H,MATCH(ROW()-2,Arkusz1!$C:$C,0)+5))","v":""},{"$f":"IF(ISERROR(MATCH(ROW()-2,Arkusz1!$C:$C,0)),\"\",INDEX('import danych'!$L:$L,MATCH(ROW()-2,Arkusz1!$C:$C,0)+5))","v":""}]
[{"$f":"IF(ISERROR(MATCH(ROW()-2,Arkusz1!$C:$C,0)),\"\",INDEX(Arkusz1!C:C,MATCH(ROW()-2,Arkusz1!$C:$C,0)))","v":""},{"$f":"IF(ISERROR(MATCH(ROW()-2,Arkusz1!$C:$C,0)),\"\",INDEX('import danych'!$A:$A,MATCH(ROW()-2,Arkusz1!$C:$C,0)+5))","v":""},"",{"$f":"IF(ISERROR(MATCH(ROW()-2,Arkusz1!$C:$C,0)),\"\",INDEX('import danych'!$B:$B,MATCH(ROW()-2,Arkusz1!$C:$C,0)+5))","v":""},{"$f":"IF(ISERROR(MATCH(ROW()-2,Arkusz1!$C:$C,0)),\"\",INDEX(Arkusz1!I:I,MATCH(ROW()-2,Arkusz1!$C:$C,0)))","v":""},{"$f":"IF(ISERROR(MATCH(ROW()-2,Arkusz1!$C:$C,0)),\"\",INDEX('import danych'!$H:$H,MATCH(ROW()-2,Arkusz1!$C:$C,0)+5))","v":""},{"$f":"IF(ISERROR(MATCH(ROW()-2,Arkusz1!$C:$C,0)),\"\",INDEX('import danych'!$L:$L,MATCH(ROW()-2,Arkusz1!$C:$C,0)+5))","v":""}]
[{"$f":"IF(ISERROR(MATCH(ROW()-2,Arkusz1!$C:$C,0)),\"\",INDEX(Arkusz1!C:C,MATCH(ROW()-2,Arkusz1!$C:$C,0)))","v":""},{"$f":"IF(ISERROR(MATCH(ROW()-2,Arkusz1!$C:$C,0)),\"\",INDEX('import danych'!$A:$A,MATCH(ROW()-2,Arkusz1!$C:$C,0)+5))","v":""},"",{"$f":"IF(ISERROR(MATCH(ROW()-2,Arkusz1!$C:$C,0)),\"\",INDEX('import danych'!$B:$B,MATCH(ROW()-2,Arkusz1!$C:$C,0)+5))","v":""},{"$f":"IF(ISERROR(MATCH(ROW()-2,Arkusz1!$C:$C,0)),\"\",INDEX(Arkusz1!I:I,MATCH(ROW()-2,Arkusz1!$C:$C,0)))","v":""},{"$f":"IF(ISERROR(MATCH(ROW()-2,Arkusz1!$C:$C,0)),\"\",INDEX('import danych'!$H:$H,MATCH(ROW()-2,Arkusz1!$C:$C,0)+5))","v":""},{"$f":"IF(ISERROR(MATCH(ROW()-2,Arkusz1!$C:$C,0)),\"\",INDEX('import danych'!$L:$L,MATCH(ROW()-2,Arkusz1!$C:$C,0)+5))","v":""}]
[{"$f":"IF(ISERROR(MATCH(ROW()-2,Arkusz1!$C:$C,0)),\"\",INDEX(Arkusz1!C:C,MATCH(ROW()-2,Arkusz1!$C:$C,0)))","v":""},{"$f":"IF(ISERROR(MATCH(ROW()-2,Arkusz1!$C:$C,0)),\"\",INDEX('import danych'!$A:$A,MATCH(ROW()-2,Arkusz1!$C:$C,0)+5))","v":""},"",{"$f":"IF(ISERROR(MATCH(ROW()-2,Arkusz1!$C:$C,0)),\"\",INDEX('import danych'!$B:$B,MATCH(ROW()-2,Arkusz1!$C:$C,0)+5))","v":""},{"$f":"IF(ISERROR(MATCH(ROW()-2,Arkusz1!$C:$C,0)),\"\",INDEX(Arkusz1!I:I,MATCH(ROW()-2,Arkusz1!$C:$C,0)))","v":""},{"$f":"IF(ISERROR(MATCH(ROW()-2,Arkusz1!$C:$C,0)),\"\",INDEX('import danych'!$H:$H,MATCH(ROW()-2,Arkusz1!$C:$C,0)+5))","v":""},{"$f":"IF(ISERROR(MATCH(ROW()-2,Arkusz1!$C:$C,0)),\"\",INDEX('import danych'!$L:$L,MATCH(ROW()-2,Arkusz1!$C:$C,0)+5))","v":""}]
[{"$f":"IF(ISERROR(MATCH(ROW()-2,Arkusz1!$C:$C,0)),\"\",INDEX(Arkusz1!C:C,MATCH(ROW()-2,Arkusz1!$C:$C,0)))","v":""},{"$f":"IF(ISERROR(MATCH(ROW()-2,Arkusz1!$C:$C,0)),\"\",INDEX('import danych'!$A:$A,MATCH(ROW()-2,Arkusz1!$C:$C,0)+5))","v":""},"",{"$f":"IF(ISERROR(MATCH(ROW()-2,Arkusz1!$C:$C,0)),\"\",INDEX('import danych'!$B:$B,MATCH(ROW()-2,Arkusz1!$C:$C,0)+5))","v":""},{"$f":"IF(ISERROR(MATCH(ROW()-2,Arkusz1!$C:$C,0)),\"\",INDEX(Arkusz1!I:I,MATCH(ROW()-2,Arkusz1!$C:$C,0)))","v":""},{"$f":"IF(ISERROR(MATCH(ROW()-2,Arkusz1!$C:$C,0)),\"\",INDEX('import danych'!$H:$H,MATCH(ROW()-2,Arkusz1!$C:$C,0)+5))","v":""},{"$f":"IF(ISERROR(MATCH(ROW()-2,Arkusz1!$C:$C,0)),\"\",INDEX('import danych'!$L:$L,MATCH(ROW()-2,Arkusz1!$C:$C,0)+5))","v":""}]
[{"$f":"IF(ISERROR(MATCH(ROW()-2,Arkusz1!$C:$C,0)),\"\",INDEX(Arkusz1!C:C,MATCH(ROW()-2,Arkusz1!$C:$C,0)))","v":""},{"$f":"IF(ISERROR(MATCH(ROW()-2,Arkusz1!$C:$C,0)),\"\",INDEX('import danych'!$A:$A,MATCH(ROW()-2,Arkusz1!$C:$C,0)+5))","v":""},"",{"$f":"IF(ISERROR(MATCH(ROW()-2,Arkusz1!$C:$C,0)),\"\",INDEX('import danych'!$B:$B,MATCH(ROW()-2,Arkusz1!$C:$C,0)+5))","v":""},{"$f":"IF(ISERROR(MATCH(ROW()-2,Arkusz1!$C:$C,0)),\"\",INDEX(Arkusz1!I:I,MATCH(ROW()-2,Arkusz1!$C:$C,0)))","v":""},{"$f":"IF(ISERROR(MATCH(ROW()-2,Arkusz1!$C:$C,0)),\"\",INDEX('import danych'!$H:$H,MATCH(ROW()-2,Arkusz1!$C:$C,0)+5))","v":""},{"$f":"IF(ISERROR(MATCH(ROW()-2,Arkusz1!$C:$C,0)),\"\",INDEX('import danych'!$L:$L,MATCH(ROW()-2,Arkusz1!$C:$C,0)+5))","v":""}]
[{"$f":"IF(ISERROR(MATCH(ROW()-2,Arkusz1!$C:$C,0)),\"\",INDEX(Arkusz1!C:C,MATCH(ROW()-2,Arkusz1!$C:$C,0)))","v":""},{"$f":"IF(ISERROR(MATCH(ROW()-2,Arkusz1!$C:$C,0)),\"\",INDEX('import danych'!$A:$A,MATCH(ROW()-2,Arkusz1!$C:$C,0)+5))","v":""},"",{"$f":"IF(ISERROR(MATCH(ROW()-2,Arkusz1!$C:$C,0)),\"\",INDEX('import danych'!$B:$B,MATCH(ROW()-2,Arkusz1!$C:$C,0)+5))","v":""},{"$f":"IF(ISERROR(MATCH(ROW()-2,Arkusz1!$C:$C,0)),\"\",INDEX(Arkusz1!I:I,MATCH(ROW()-2,Arkusz1!$C:$C,0)))","v":""},{"$f":"IF(ISERROR(MATCH(ROW()-2,Arkusz1!$C:$C,0)),\"\",INDEX('import danych'!$H:$H,MATCH(ROW()-2,Arkusz1!$C:$C,0)+5))","v":""},{"$f":"IF(ISERROR(MATCH(ROW()-2,Arkusz1!$C:$C,0)),\"\",INDEX('import danych'!$L:$L,MATCH(ROW()-2,Arkusz1!$C:$C,0)+5))","v":""}]
[{"$f":"IF(ISERROR(MATCH(ROW()-2,Arkusz1!$C:$C,0)),\"\",INDEX(Arkusz1!C:C,MATCH(ROW()-2,Arkusz1!$C:$C,0)))","v":""},{"$f":"IF(ISERROR(MATCH(ROW()-2,Arkusz1!$C:$C,0)),\"\",INDEX('import danych'!$A:$A,MATCH(ROW()-2,Arkusz1!$C:$C,0)+5))","v":""},"",{"$f":"IF(ISERROR(MATCH(ROW()-2,Arkusz1!$C:$C,0)),\"\",INDEX('import danych'!$B:$B,MATCH(ROW()-2,Arkusz1!$C:$C,0)+5))","v":""},{"$f":"IF(ISERROR(MATCH(ROW()-2,Arkusz1!$C:$C,0)),\"\",INDEX(Arkusz1!I:I,MATCH(ROW()-2,Arkusz1!$C:$C,0)))","v":""},{"$f":"IF(ISERROR(MATCH(ROW()-2,Arkusz1!$C:$C,0)),\"\",INDEX('import danych'!$H:$H,MATCH(ROW()-2,Arkusz1!$C:$C,0)+5))","v":""},{"$f":"IF(ISERROR(MATCH(ROW()-2,Arkusz1!$C:$C,0)),\"\",INDEX('import danych'!$L:$L,MATCH(ROW()-2,Arkusz1!$C:$C,0)+5))","v":""}]
[{"$f":"IF(ISERROR(MATCH(ROW()-2,Arkusz1!$C:$C,0)),\"\",INDEX(Arkusz1!C:C,MATCH(ROW()-2,Arkusz1!$C:$C,0)))","v":""},{"$f":"IF(ISERROR(MATCH(ROW()-2,Arkusz1!$C:$C,0)),\"\",INDEX('import danych'!$A:$A,MATCH(ROW()-2,Arkusz1!$C:$C,0)+5))","v":""},"",{"$f":"IF(ISERROR(MATCH(ROW()-2,Arkusz1!$C:$C,0)),\"\",INDEX('import danych'!$B:$B,MATCH(ROW()-2,Arkusz1!$C:$C,0)+5))","v":""},{"$f":"IF(ISERROR(MATCH(ROW()-2,Arkusz1!$C:$C,0)),\"\",INDEX(Arkusz1!I:I,MATCH(ROW()-2,Arkusz1!$C:$C,0)))","v":""},{"$f":"IF(ISERROR(MATCH(ROW()-2,Arkusz1!$C:$C,0)),\"\",INDEX('import danych'!$H:$H,MATCH(ROW()-2,Arkusz1!$C:$C,0)+5))","v":""},{"$f":"IF(ISERROR(MATCH(ROW()-2,Arkusz1!$C:$C,0)),\"\",INDEX('import danych'!$L:$L,MATCH(ROW()-2,Arkusz1!$C:$C,0)+5))","v":""}]
[{"$f":"IF(ISERROR(MATCH(ROW()-2,Arkusz1!$C:$C,0)),\"\",INDEX(Arkusz1!C:C,MATCH(ROW()-2,Arkusz1!$C:$C,0)))","v":""},{"$f":"IF(ISERROR(MATCH(ROW()-2,Arkusz1!$C:$C,0)),\"\",INDEX('import danych'!$A:$A,MATCH(ROW()-2,Arkusz1!$C:$C,0)+5))","v":""},"",{"$f":"IF(ISERROR(MATCH(ROW()-2,Arkusz1!$C:$C,0)),\"\",INDEX('import danych'!$B:$B,MATCH(ROW()-2,Arkusz1!$C:$C,0)+5))","v":""},{"$f":"IF(ISERROR(MATCH(ROW()-2,Arkusz1!$C:$C,0)),\"\",INDEX(Arkusz1!I:I,MATCH(ROW()-2,Arkusz1!$C:$C,0)))","v":""},{"$f":"IF(ISERROR(MATCH(ROW()-2,Arkusz1!$C:$C,0)),\"\",INDEX('import danych'!$H:$H,MATCH(ROW()-2,Arkusz1!$C:$C,0)+5))","v":""},{"$f":"IF(ISERROR(MATCH(ROW()-2,Arkusz1!$C:$C,0)),\"\",INDEX('import danych'!$L:$L,MATCH(ROW()-2,Arkusz1!$C:$C,0)+5))","v":""}]
[{"$f":"IF(ISERROR(MATCH(ROW()-2,Arkusz1!$C:$C,0)),\"\",INDEX(Arkusz1!C:C,MATCH(ROW()-2,Arkusz1!$C:$C,0)))","v":""},{"$f":"IF(ISERROR(MATCH(ROW()-2,Arkusz1!$C:$C,0)),\"\",INDEX('import danych'!$A:$A,MATCH(ROW()-2,Arkusz1!$C:$C,0)+5))","v":""},"",{"$f":"IF(ISERROR(MATCH(ROW()-2,Arkusz1!$C:$C,0)),\"\",INDEX('import danych'!$B:$B,MATCH(ROW()-2,Arkusz1!$C:$C,0)+5))","v":""},{"$f":"IF(ISERROR(MATCH(ROW()-2,Arkusz1!$C:$C,0)),\"\",INDEX(Arkusz1!I:I,MATCH(ROW()-2,Arkusz1!$C:$C,0)))","v":""},{"$f":"IF(ISERROR(MATCH(ROW()-2,Arkusz1!$C:$C,0)),\"\",INDEX('import danych'!$H:$H,MATCH(ROW()-2,Arkusz1!$C:$C,0)+5))","v":""},{"$f":"IF(ISERROR(MATCH(ROW()-2,Arkusz1!$C:$C,0)),\"\",INDEX('import danych'!$L:$L,MATCH(ROW()-2,Arkusz1!$C:$C,0)+5))","v":""}]
[{"$f":"IF(ISERROR(MATCH(ROW()-2,Arkusz1!$C:$C,0)),\"\",INDEX(Arkusz1!C:C,MATCH(ROW()-2,Arkusz1!$C:$C,0)))","v":""},{"$f":"IF(ISERROR(MATCH(ROW()-2,Arkusz1!$C:$C,0)),\"\",INDEX('import danych'!$A:$A,MATCH(ROW()-2,Arkusz1!$C:$C,0)+5))","v":""},"",{"$f":"IF(ISERROR(MATCH(ROW()-2,Arkusz1!$C:$C,0)),\"\",INDEX('import danych'!$B:$B,MATCH(ROW()-2,Arkusz1!$C:$C,0)+5))","v":""},{"$f":"IF(ISERROR(MATCH(ROW()-2,Arkusz1!$C:$C,0)),\"\",INDEX(Arkusz1!I:I,MATCH(ROW()-2,Arkusz1!$C:$C,0)))","v":""},{"$f":"IF(ISERROR(MATCH(ROW()-2,Arkusz1!$C:$C,0)),\"\",INDEX('import danych'!$H:$H,MATCH(ROW()-2,Arkusz1!$C:$C,0)+5))","v":""},{"$f":"IF(ISERROR(MATCH(ROW()-2,Arkusz1!$C:$C,0)),\"\",INDEX('import danych'!$L:$L,MATCH(ROW()-2,Arkusz1!$C:$C,0)+5))","v":""}]
[{"$f":"IF(ISERROR(MATCH(ROW()-2,Arkusz1!$C:$C,0)),\"\",INDEX(Arkusz1!C:C,MATCH(ROW()-2,Arkusz1!$C:$C,0)))","v":""},{"$f":"IF(ISERROR(MATCH(ROW()-2,Arkusz1!$C:$C,0)),\"\",INDEX('import danych'!$A:$A,MATCH(ROW()-2,Arkusz1!$C:$C,0)+5))","v":""},"",{"$f":"IF(ISERROR(MATCH(ROW()-2,Arkusz1!$C:$C,0)),\"\",INDEX('import danych'!$B:$B,MATCH(ROW()-2,Arkusz1!$C:$C,0)+5))","v":""},{"$f":"IF(ISERROR(MATCH(ROW()-2,Arkusz1!$C:$C,0)),\"\",INDEX(Arkusz1!I:I,MATCH(ROW()-2,Arkusz1!$C:$C,0)))","v":""},{"$f":"IF(ISERROR(MATCH(ROW()-2,Arkusz1!$C:$C,0)),\"\",INDEX('import danych'!$H:$H,MATCH(ROW()-2,Arkusz1!$C:$C,0)+5))","v":""},{"$f":"IF(ISERROR(MATCH(ROW()-2,Arkusz1!$C:$C,0)),\"\",INDEX('import danych'!$L:$L,MATCH(ROW()-2,Arkusz1!$C:$C,0)+5))","v":""}]
[{"$f":"IF(ISERROR(MATCH(ROW()-2,Arkusz1!$C:$C,0)),\"\",INDEX(Arkusz1!C:C,MATCH(ROW()-2,Arkusz1!$C:$C,0)))","v":""},{"$f":"IF(ISERROR(MATCH(ROW()-2,Arkusz1!$C:$C,0)),\"\",INDEX('import danych'!$A:$A,MATCH(ROW()-2,Arkusz1!$C:$C,0)+5))","v":""},"",{"$f":"IF(ISERROR(MATCH(ROW()-2,Arkusz1!$C:$C,0)),\"\",INDEX('import danych'!$B:$B,MATCH(ROW()-2,Arkusz1!$C:$C,0)+5))","v":""},{"$f":"IF(ISERROR(MATCH(ROW()-2,Arkusz1!$C:$C,0)),\"\",INDEX(Arkusz1!I:I,MATCH(ROW()-2,Arkusz1!$C:$C,0)))","v":""},{"$f":"IF(ISERROR(MATCH(ROW()-2,Arkusz1!$C:$C,0)),\"\",INDEX('import danych'!$H:$H,MATCH(ROW()-2,Arkusz1!$C:$C,0)+5))","v":""},{"$f":"IF(ISERROR(MATCH(ROW()-2,Arkusz1!$C:$C,0)),\"\",INDEX('import danych'!$L:$L,MATCH(ROW()-2,Arkusz1!$C:$C,0)+5))","v":""}]
[{"$f":"IF(ISERROR(MATCH(ROW()-2,Arkusz1!$C:$C,0)),\"\",INDEX(Arkusz1!C:C,MATCH(ROW()-2,Arkusz1!$C:$C,0)))","v":""},{"$f":"IF(ISERROR(MATCH(ROW()-2,Arkusz1!$C:$C,0)),\"\",INDEX('import danych'!$A:$A,MATCH(ROW()-2,Arkusz1!$C:$C,0)+5))","v":""},"",{"$f":"IF(ISERROR(MATCH(ROW()-2,Arkusz1!$C:$C,0)),\"\",INDEX('import danych'!$B:$B,MATCH(ROW()-2,Arkusz1!$C:$C,0)+5))","v":""},{"$f":"IF(ISERROR(MATCH(ROW()-2,Arkusz1!$C:$C,0)),\"\",INDEX(Arkusz1!I:I,MATCH(ROW()-2,Arkusz1!$C:$C,0)))","v":""},{"$f":"IF(ISERROR(MATCH(ROW()-2,Arkusz1!$C:$C,0)),\"\",INDEX('import danych'!$H:$H,MATCH(ROW()-2,Arkusz1!$C:$C,0)+5))","v":""},{"$f":"IF(ISERROR(MATCH(ROW()-2,Arkusz1!$C:$C,0)),\"\",INDEX('import danych'!$L:$L,MATCH(ROW()-2,Arkusz1!$C:$C,0)+5))","v":""}]
[{"$f":"IF(ISERROR(MATCH(ROW()-2,Arkusz1!$C:$C,0)),\"\",INDEX(Arkusz1!C:C,MATCH(ROW()-2,Arkusz1!$C:$C,0)))","v":""},{"$f":"IF(ISERROR(MATCH(ROW()-2,Arkusz1!$C:$C,0)),\"\",INDEX('import danych'!$A:$A,MATCH(ROW()-2,Arkusz1!$C:$C,0)+5))","v":""},"",{"$f":"IF(ISERROR(MATCH(ROW()-2,Arkusz1!$C:$C,0)),\"\",INDEX('import danych'!$B:$B,MATCH(ROW()-2,Arkusz1!$C:$C,0)+5))","v":""},{"$f":"IF(ISERROR(MATCH(ROW()-2,Arkusz1!$C:$C,0)),\"\",INDEX(Arkusz1!I:I,MATCH(ROW()-2,Arkusz1!$C:$C,0)))","v":""},{"$f":"IF(ISERROR(MATCH(ROW()-2,Arkusz1!$C:$C,0)),\"\",INDEX('import danych'!$H:$H,MATCH(ROW()-2,Arkusz1!$C:$C,0)+5))","v":""},{"$f":"IF(ISERROR(MATCH(ROW()-2,Arkusz1!$C:$C,0)),\"\",INDEX('import danych'!$L:$L,MATCH(ROW()-2,Arkusz1!$C:$C,0)+5))","v":""}]
[{"$f":"IF(ISERROR(MATCH(ROW()-2,Arkusz1!$C:$C,0)),\"\",INDEX(Arkusz1!C:C,MATCH(ROW()-2,Arkusz1!$C:$C,0)))","v":""},{"$f":"IF(ISERROR(MATCH(ROW()-2,Arkusz1!$C:$C,0)),\"\",INDEX('import danych'!$A:$A,MATCH(ROW()-2,Arkusz1!$C:$C,0)+5))","v":""},"",{"$f":"IF(ISERROR(MATCH(ROW()-2,Arkusz1!$C:$C,0)),\"\",INDEX('import danych'!$B:$B,MATCH(ROW()-2,Arkusz1!$C:$C,0)+5))","v":""},{"$f":"IF(ISERROR(MATCH(ROW()-2,Arkusz1!$C:$C,0)),\"\",INDEX(Arkusz1!I:I,MATCH(ROW()-2,Arkusz1!$C:$C,0)))","v":""},{"$f":"IF(ISERROR(MATCH(ROW()-2,Arkusz1!$C:$C,0)),\"\",INDEX('import danych'!$H:$H,MATCH(ROW()-2,Arkusz1!$C:$C,0)+5))","v":""},{"$f":"IF(ISERROR(MATCH(ROW()-2,Arkusz1!$C:$C,0)),\"\",INDEX('import danych'!$L:$L,MATCH(ROW()-2,Arkusz1!$C:$C,0)+5))","v":""}]
[{"$f":"IF(ISERROR(MATCH(ROW()-2,Arkusz1!$C:$C,0)),\"\",INDEX(Arkusz1!C:C,MATCH(ROW()-2,Arkusz1!$C:$C,0)))","v":""},{"$f":"IF(ISERROR(MATCH(ROW()-2,Arkusz1!$C:$C,0)),\"\",INDEX('import danych'!$A:$A,MATCH(ROW()-2,Arkusz1!$C:$C,0)+5))","v":""},"",{"$f":"IF(ISERROR(MATCH(ROW()-2,Arkusz1!$C:$C,0)),\"\",INDEX('import danych'!$B:$B,MATCH(ROW()-2,Arkusz1!$C:$C,0)+5))","v":""},{"$f":"IF(ISERROR(MATCH(ROW()-2,Arkusz1!$C:$C,0)),\"\",INDEX(Arkusz1!I:I,MATCH(ROW()-2,Arkusz1!$C:$C,0)))","v":""},{"$f":"IF(ISERROR(MATCH(ROW()-2,Arkusz1!$C:$C,0)),\"\",INDEX('import danych'!$H:$H,MATCH(ROW()-2,Arkusz1!$C:$C,0)+5))","v":""},{"$f":"IF(ISERROR(MATCH(ROW()-2,Arkusz1!$C:$C,0)),\"\",INDEX('import danych'!$L:$L,MATCH(ROW()-2,Arkusz1!$C:$C,0)+5))","v":""}]
[{"$f":"IF(ISERROR(MATCH(ROW()-2,Arkusz1!$C:$C,0)),\"\",INDEX(Arkusz1!C:C,MATCH(ROW()-2,Arkusz1!$C:$C,0)))","v":""},{"$f":"IF(ISERROR(MATCH(ROW()-2,Arkusz1!$C:$C,0)),\"\",INDEX('import danych'!$A:$A,MATCH(ROW()-2,Arkusz1!$C:$C,0)+5))","v":""},"",{"$f":"IF(ISERROR(MATCH(ROW()-2,Arkusz1!$C:$C,0)),\"\",INDEX('import danych'!$B:$B,MATCH(ROW()-2,Arkusz1!$C:$C,0)+5))","v":""},{"$f":"IF(ISERROR(MATCH(ROW()-2,Arkusz1!$C:$C,0)),\"\",INDEX(Arkusz1!I:I,MATCH(ROW()-2,Arkusz1!$C:$C,0)))","v":""},{"$f":"IF(ISERROR(MATCH(ROW()-2,Arkusz1!$C:$C,0)),\"\",INDEX('import danych'!$H:$H,MATCH(ROW()-2,Arkusz1!$C:$C,0)+5))","v":""},{"$f":"IF(ISERROR(MATCH(ROW()-2,Arkusz1!$C:$C,0)),\"\",INDEX('import danych'!$L:$L,MATCH(ROW()-2,Arkusz1!$C:$C,0)+5))","v":""}]
[{"$f":"IF(ISERROR(MATCH(ROW()-2,Arkusz1!$C:$C,0)),\"\",INDEX(Arkusz1!C:C,MATCH(ROW()-2,Arkusz1!$C:$C,0)))","v":""},{"$f":"IF(ISERROR(MATCH(ROW()-2,Arkusz1!$C:$C,0)),\"\",INDEX('import danych'!$A:$A,MATCH(ROW()-2,Arkusz1!$C:$C,0)+5))","v":""},"",{"$f":"IF(ISERROR(MATCH(ROW()-2,Arkusz1!$C:$C,0)),\"\",INDEX('import danych'!$B:$B,MATCH(ROW()-2,Arkusz1!$C:$C,0)+5))","v":""},{"$f":"IF(ISERROR(MATCH(ROW()-2,Arkusz1!$C:$C,0)),\"\",INDEX(Arkusz1!I:I,MATCH(ROW()-2,Arkusz1!$C:$C,0)))","v":""},{"$f":"IF(ISERROR(MATCH(ROW()-2,Arkusz1!$C:$C,0)),\"\",INDEX('import danych'!$H:$H,MATCH(ROW()-2,Arkusz1!$C:$C,0)+5))","v":""},{"$f":"IF(ISERROR(MATCH(ROW()-2,Arkusz1!$C:$C,0)),\"\",INDEX('import danych'!$L:$L,MATCH(ROW()-2,Arkusz1!$C:$C,0)+5))","v":""}]
[{"$f":"IF(ISERROR(MATCH(ROW()-2,Arkusz1!$C:$C,0)),\"\",INDEX(Arkusz1!C:C,MATCH(ROW()-2,Arkusz1!$C:$C,0)))","v":""},{"$f":"IF(ISERROR(MATCH(ROW()-2,Arkusz1!$C:$C,0)),\"\",INDEX('import danych'!$A:$A,MATCH(ROW()-2,Arkusz1!$C:$C,0)+5))","v":""},"",{"$f":"IF(ISERROR(MATCH(ROW()-2,Arkusz1!$C:$C,0)),\"\",INDEX('import danych'!$B:$B,MATCH(ROW()-2,Arkusz1!$C:$C,0)+5))","v":""},{"$f":"IF(ISERROR(MATCH(ROW()-2,Arkusz1!$C:$C,0)),\"\",INDEX(Arkusz1!I:I,MATCH(ROW()-2,Arkusz1!$C:$C,0)))","v":""},{"$f":"IF(ISERROR(MATCH(ROW()-2,Arkusz1!$C:$C,0)),\"\",INDEX('import danych'!$H:$H,MATCH(ROW()-2,Arkusz1!$C:$C,0)+5))","v":""},{"$f":"IF(ISERROR(MATCH(ROW()-2,Arkusz1!$C:$C,0)),\"\",INDEX('import danych'!$L:$L,MATCH(ROW()-2,Arkusz1!$C:$C,0)+5))","v":""}]
[{"$f":"IF(ISERROR(MATCH(ROW()-2,Arkusz1!$C:$C,0)),\"\",INDEX(Arkusz1!C:C,MATCH(ROW()-2,Arkusz1!$C:$C,0)))","v":""},{"$f":"IF(ISERROR(MATCH(ROW()-2,Arkusz1!$C:$C,0)),\"\",INDEX('import danych'!$A:$A,MATCH(ROW()-2,Arkusz1!$C:$C,0)+5))","v":""},"",{"$f":"IF(ISERROR(MATCH(ROW()-2,Arkusz1!$C:$C,0)),\"\",INDEX('import danych'!$B:$B,MATCH(ROW()-2,Arkusz1!$C:$C,0)+5))","v":""},{"$f":"IF(ISERROR(MATCH(ROW()-2,Arkusz1!$C:$C,0)),\"\",INDEX(Arkusz1!I:I,MATCH(ROW()-2,Arkusz1!$C:$C,0)))","v":""},{"$f":"IF(ISERROR(MATCH(ROW()-2,Arkusz1!$C:$C,0)),\"\",INDEX('import danych'!$H:$H,MATCH(ROW()-2,Arkusz1!$C:$C,0)+5))","v":""},{"$f":"IF(ISERROR(MATCH(ROW()-2,Arkusz1!$C:$C,0)),\"\",INDEX('import danych'!$L:$L,MATCH(ROW()-2,Arkusz1!$C:$C,0)+5))","v":""}]
[{"$f":"IF(ISERROR(MATCH(ROW()-2,Arkusz1!$C:$C,0)),\"\",INDEX(Arkusz1!C:C,MATCH(ROW()-2,Arkusz1!$C:$C,0)))","v":""},{"$f":"IF(ISERROR(MATCH(ROW()-2,Arkusz1!$C:$C,0)),\"\",INDEX('import danych'!$A:$A,MATCH(ROW()-2,Arkusz1!$C:$C,0)+5))","v":""},"",{"$f":"IF(ISERROR(MATCH(ROW()-2,Arkusz1!$C:$C,0)),\"\",INDEX('import danych'!$B:$B,MATCH(ROW()-2,Arkusz1!$C:$C,0)+5))","v":""},{"$f":"IF(ISERROR(MATCH(ROW()-2,Arkusz1!$C:$C,0)),\"\",INDEX(Arkusz1!I:I,MATCH(ROW()-2,Arkusz1!$C:$C,0)))","v":""},{"$f":"IF(ISERROR(MATCH(ROW()-2,Arkusz1!$C:$C,0)),\"\",INDEX('import danych'!$H:$H,MATCH(ROW()-2,Arkusz1!$C:$C,0)+5))","v":""},{"$f":"IF(ISERROR(MATCH(ROW()-2,Arkusz1!$C:$C,0)),\"\",INDEX('import danych'!$L:$L,MATCH(ROW()-2,Arkusz1!$C:$C,0)+5))","v":""}]
[{"$f":"IF(ISERROR(MATCH(ROW()-2,Arkusz1!$C:$C,0)),\"\",INDEX(Arkusz1!C:C,MATCH(ROW()-2,Arkusz1!$C:$C,0)))","v":""},{"$f":"IF(ISERROR(MATCH(ROW()-2,Arkusz1!$C:$C,0)),\"\",INDEX('import danych'!$A:$A,MATCH(ROW()-2,Arkusz1!$C:$C,0)+5))","v":""},"",{"$f":"IF(ISERROR(MATCH(ROW()-2,Arkusz1!$C:$C,0)),\"\",INDEX('import danych'!$B:$B,MATCH(ROW()-2,Arkusz1!$C:$C,0)+5))","v":""},{"$f":"IF(ISERROR(MATCH(ROW()-2,Arkusz1!$C:$C,0)),\"\",INDEX(Arkusz1!I:I,MATCH(ROW()-2,Arkusz1!$C:$C,0)))","v":""},{"$f":"IF(ISERROR(MATCH(ROW()-2,Arkusz1!$C:$C,0)),\"\",INDEX('import danych'!$H:$H,MATCH(ROW()-2,Arkusz1!$C:$C,0)+5))","v":""},{"$f":"IF(ISERROR(MATCH(ROW()-2,Arkusz1!$C:$C,0)),\"\",INDEX('import danych'!$L:$L,MATCH(ROW()-2,Arkusz1!$C:$C,0)+5))","v":""}]
[{"$f":"IF(ISERROR(MATCH(ROW()-2,Arkusz1!$C:$C,0)),\"\",INDEX(Arkusz1!C:C,MATCH(ROW()-2,Arkusz1!$C:$C,0)))","v":""},{"$f":"IF(ISERROR(MATCH(ROW()-2,Arkusz1!$C:$C,0)),\"\",INDEX('import danych'!$A:$A,MATCH(ROW()-2,Arkusz1!$C:$C,0)+5))","v":""},"",{"$f":"IF(ISERROR(MATCH(ROW()-2,Arkusz1!$C:$C,0)),\"\",INDEX('import danych'!$B:$B,MATCH(ROW()-2,Arkusz1!$C:$C,0)+5))","v":""},{"$f":"IF(ISERROR(MATCH(ROW()-2,Arkusz1!$C:$C,0)),\"\",INDEX(Arkusz1!I:I,MATCH(ROW()-2,Arkusz1!$C:$C,0)))","v":""},{"$f":"IF(ISERROR(MATCH(ROW()-2,Arkusz1!$C:$C,0)),\"\",INDEX('import danych'!$H:$H,MATCH(ROW()-2,Arkusz1!$C:$C,0)+5))","v":""},{"$f":"IF(ISERROR(MATCH(ROW()-2,Arkusz1!$C:$C,0)),\"\",INDEX('import danych'!$L:$L,MATCH(ROW()-2,Arkusz1!$C:$C,0)+5))","v":""}]
[{"$f":"IF(ISERROR(MATCH(ROW()-2,Arkusz1!$C:$C,0)),\"\",INDEX(Arkusz1!C:C,MATCH(ROW()-2,Arkusz1!$C:$C,0)))","v":""},{"$f":"IF(ISERROR(MATCH(ROW()-2,Arkusz1!$C:$C,0)),\"\",INDEX('import danych'!$A:$A,MATCH(ROW()-2,Arkusz1!$C:$C,0)+5))","v":""},"",{"$f":"IF(ISERROR(MATCH(ROW()-2,Arkusz1!$C:$C,0)),\"\",INDEX('import danych'!$B:$B,MATCH(ROW()-2,Arkusz1!$C:$C,0)+5))","v":""},{"$f":"IF(ISERROR(MATCH(ROW()-2,Arkusz1!$C:$C,0)),\"\",INDEX(Arkusz1!I:I,MATCH(ROW()-2,Arkusz1!$C:$C,0)))","v":""},{"$f":"IF(ISERROR(MATCH(ROW()-2,Arkusz1!$C:$C,0)),\"\",INDEX('import danych'!$H:$H,MATCH(ROW()-2,Arkusz1!$C:$C,0)+5))","v":""},{"$f":"IF(ISERROR(MATCH(ROW()-2,Arkusz1!$C:$C,0)),\"\",INDEX('import danych'!$L:$L,MATCH(ROW()-2,Arkusz1!$C:$C,0)+5))","v":""}]
[{"$f":"IF(ISERROR(MATCH(ROW()-2,Arkusz1!$C:$C,0)),\"\",INDEX(Arkusz1!C:C,MATCH(ROW()-2,Arkusz1!$C:$C,0)))","v":""},{"$f":"IF(ISERROR(MATCH(ROW()-2,Arkusz1!$C:$C,0)),\"\",INDEX('import danych'!$A:$A,MATCH(ROW()-2,Arkusz1!$C:$C,0)+5))","v":""},"",{"$f":"IF(ISERROR(MATCH(ROW()-2,Arkusz1!$C:$C,0)),\"\",INDEX('import danych'!$B:$B,MATCH(ROW()-2,Arkusz1!$C:$C,0)+5))","v":""},{"$f":"IF(ISERROR(MATCH(ROW()-2,Arkusz1!$C:$C,0)),\"\",INDEX(Arkusz1!I:I,MATCH(ROW()-2,Arkusz1!$C:$C,0)))","v":""},{"$f":"IF(ISERROR(MATCH(ROW()-2,Arkusz1!$C:$C,0)),\"\",INDEX('import danych'!$H:$H,MATCH(ROW()-2,Arkusz1!$C:$C,0)+5))","v":""},{"$f":"IF(ISERROR(MATCH(ROW()-2,Arkusz1!$C:$C,0)),\"\",INDEX('import danych'!$L:$L,MATCH(ROW()-2,Arkusz1!$C:$C,0)+5))","v":""}]
[{"$f":"IF(ISERROR(MATCH(ROW()-2,Arkusz1!$C:$C,0)),\"\",INDEX(Arkusz1!C:C,MATCH(ROW()-2,Arkusz1!$C:$C,0)))","v":""},{"$f":"IF(ISERROR(MATCH(ROW()-2,Arkusz1!$C:$C,0)),\"\",INDEX('import danych'!$A:$A,MATCH(ROW()-2,Arkusz1!$C:$C,0)+5))","v":""},"",{"$f":"IF(ISERROR(MATCH(ROW()-2,Arkusz1!$C:$C,0)),\"\",INDEX('import danych'!$B:$B,MATCH(ROW()-2,Arkusz1!$C:$C,0)+5))","v":""},{"$f":"IF(ISERROR(MATCH(ROW()-2,Arkusz1!$C:$C,0)),\"\",INDEX(Arkusz1!I:I,MATCH(ROW()-2,Arkusz1!$C:$C,0)))","v":""},{"$f":"IF(ISERROR(MATCH(ROW()-2,Arkusz1!$C:$C,0)),\"\",INDEX('import danych'!$H:$H,MATCH(ROW()-2,Arkusz1!$C:$C,0)+5))","v":""},{"$f":"IF(ISERROR(MATCH(ROW()-2,Arkusz1!$C:$C,0)),\"\",INDEX('import danych'!$L:$L,MATCH(ROW()-2,Arkusz1!$C:$C,0)+5))","v":""}]
[{"$f":"IF(ISERROR(MATCH(ROW()-2,Arkusz1!$C:$C,0)),\"\",INDEX(Arkusz1!C:C,MATCH(ROW()-2,Arkusz1!$C:$C,0)))","v":""},{"$f":"IF(ISERROR(MATCH(ROW()-2,Arkusz1!$C:$C,0)),\"\",INDEX('import danych'!$A:$A,MATCH(ROW()-2,Arkusz1!$C:$C,0)+5))","v":""},"",{"$f":"IF(ISERROR(MATCH(ROW()-2,Arkusz1!$C:$C,0)),\"\",INDEX('import danych'!$B:$B,MATCH(ROW()-2,Arkusz1!$C:$C,0)+5))","v":""},{"$f":"IF(ISERROR(MATCH(ROW()-2,Arkusz1!$C:$C,0)),\"\",INDEX(Arkusz1!I:I,MATCH(ROW()-2,Arkusz1!$C:$C,0)))","v":""},{"$f":"IF(ISERROR(MATCH(ROW()-2,Arkusz1!$C:$C,0)),\"\",INDEX('import danych'!$H:$H,MATCH(ROW()-2,Arkusz1!$C:$C,0)+5))","v":""},{"$f":"IF(ISERROR(MATCH(ROW()-2,Arkusz1!$C:$C,0)),\"\",INDEX('import danych'!$L:$L,MATCH(ROW()-2,Arkusz1!$C:$C,0)+5))","v":""}]
[{"$f":"IF(ISERROR(MATCH(ROW()-2,Arkusz1!$C:$C,0)),\"\",INDEX(Arkusz1!C:C,MATCH(ROW()-2,Arkusz1!$C:$C,0)))","v":""},{"$f":"IF(ISERROR(MATCH(ROW()-2,Arkusz1!$C:$C,0)),\"\",INDEX('import danych'!$A:$A,MATCH(ROW()-2,Arkusz1!$C:$C,0)+5))","v":""},"",{"$f":"IF(ISERROR(MATCH(ROW()-2,Arkusz1!$C:$C,0)),\"\",INDEX('import danych'!$B:$B,MATCH(ROW()-2,Arkusz1!$C:$C,0)+5))","v":""},{"$f":"IF(ISERROR(MATCH(ROW()-2,Arkusz1!$C:$C,0)),\"\",INDEX(Arkusz1!I:I,MATCH(ROW()-2,Arkusz1!$C:$C,0)))","v":""},{"$f":"IF(ISERROR(MATCH(ROW()-2,Arkusz1!$C:$C,0)),\"\",INDEX('import danych'!$H:$H,MATCH(ROW()-2,Arkusz1!$C:$C,0)+5))","v":""},{"$f":"IF(ISERROR(MATCH(ROW()-2,Arkusz1!$C:$C,0)),\"\",INDEX('import danych'!$L:$L,MATCH(ROW()-2,Arkusz1!$C:$C,0)+5))","v":""}]
[{"$f":"IF(ISERROR(MATCH(ROW()-2,Arkusz1!$C:$C,0)),\"\",INDEX(Arkusz1!C:C,MATCH(ROW()-2,Arkusz1!$C:$C,0)))","v":""},{"$f":"IF(ISERROR(MATCH(ROW()-2,Arkusz1!$C:$C,0)),\"\",INDEX('import danych'!$A:$A,MATCH(ROW()-2,Arkusz1!$C:$C,0)+5))","v":""},"",{"$f":"IF(ISERROR(MATCH(ROW()-2,Arkusz1!$C:$C,0)),\"\",INDEX('import danych'!$B:$B,MATCH(ROW()-2,Arkusz1!$C:$C,0)+5))","v":""},{"$f":"IF(ISERROR(MATCH(ROW()-2,Arkusz1!$C:$C,0)),\"\",INDEX(Arkusz1!I:I,MATCH(ROW()-2,Arkusz1!$C:$C,0)))","v":""},{"$f":"IF(ISERROR(MATCH(ROW()-2,Arkusz1!$C:$C,0)),\"\",INDEX('import danych'!$H:$H,MATCH(ROW()-2,Arkusz1!$C:$C,0)+5))","v":""},{"$f":"IF(ISERROR(MATCH(ROW()-2,Arkusz1!$C:$C,0)),\"\",INDEX('import danych'!$L:$L,MATCH(ROW()-2,Arkusz1!$C:$C,0)+5))","v":""}]
[{"$f":"IF(ISERROR(MATCH(ROW()-2,Arkusz1!$C:$C,0)),\"\",INDEX(Arkusz1!C:C,MATCH(ROW()-2,Arkusz1!$C:$C,0)))","v":""},{"$f":"IF(ISERROR(MATCH(ROW()-2,Arkusz1!$C:$C,0)),\"\",INDEX('import danych'!$A:$A,MATCH(ROW()-2,Arkusz1!$C:$C,0)+5))","v":""},"",{"$f":"IF(ISERROR(MATCH(ROW()-2,Arkusz1!$C:$C,0)),\"\",INDEX('import danych'!$B:$B,MATCH(ROW()-2,Arkusz1!$C:$C,0)+5))","v":""},{"$f":"IF(ISERROR(MATCH(ROW()-2,Arkusz1!$C:$C,0)),\"\",INDEX(Arkusz1!I:I,MATCH(ROW()-2,Arkusz1!$C:$C,0)))","v":""},{"$f":"IF(ISERROR(MATCH(ROW()-2,Arkusz1!$C:$C,0)),\"\",INDEX('import danych'!$H:$H,MATCH(ROW()-2,Arkusz1!$C:$C,0)+5))","v":""},{"$f":"IF(ISERROR(MATCH(ROW()-2,Arkusz1!$C:$C,0)),\"\",INDEX('import danych'!$L:$L,MATCH(ROW()-2,Arkusz1!$C:$C,0)+5))","v":""}]
[{"$f":"IF(ISERROR(MATCH(ROW()-2,Arkusz1!$C:$C,0)),\"\",INDEX(Arkusz1!C:C,MATCH(ROW()-2,Arkusz1!$C:$C,0)))","v":""},{"$f":"IF(ISERROR(MATCH(ROW()-2,Arkusz1!$C:$C,0)),\"\",INDEX('import danych'!$A:$A,MATCH(ROW()-2,Arkusz1!$C:$C,0)+5))","v":""},"",{"$f":"IF(ISERROR(MATCH(ROW()-2,Arkusz1!$C:$C,0)),\"\",INDEX('import danych'!$B:$B,MATCH(ROW()-2,Arkusz1!$C:$C,0)+5))","v":""},{"$f":"IF(ISERROR(MATCH(ROW()-2,Arkusz1!$C:$C,0)),\"\",INDEX(Arkusz1!I:I,MATCH(ROW()-2,Arkusz1!$C:$C,0)))","v":""},{"$f":"IF(ISERROR(MATCH(ROW()-2,Arkusz1!$C:$C,0)),\"\",INDEX('import danych'!$H:$H,MATCH(ROW()-2,Arkusz1!$C:$C,0)+5))","v":""},{"$f":"IF(ISERROR(MATCH(ROW()-2,Arkusz1!$C:$C,0)),\"\",INDEX('import danych'!$L:$L,MATCH(ROW()-2,Arkusz1!$C:$C,0)+5))","v":""}]
[{"$f":"IF(ISERROR(MATCH(ROW()-2,Arkusz1!$C:$C,0)),\"\",INDEX(Arkusz1!C:C,MATCH(ROW()-2,Arkusz1!$C:$C,0)))","v":""},{"$f":"IF(ISERROR(MATCH(ROW()-2,Arkusz1!$C:$C,0)),\"\",INDEX('import danych'!$A:$A,MATCH(ROW()-2,Arkusz1!$C:$C,0)+5))","v":""},"",{"$f":"IF(ISERROR(MATCH(ROW()-2,Arkusz1!$C:$C,0)),\"\",INDEX('import danych'!$B:$B,MATCH(ROW()-2,Arkusz1!$C:$C,0)+5))","v":""},{"$f":"IF(ISERROR(MATCH(ROW()-2,Arkusz1!$C:$C,0)),\"\",INDEX(Arkusz1!I:I,MATCH(ROW()-2,Arkusz1!$C:$C,0)))","v":""},{"$f":"IF(ISERROR(MATCH(ROW()-2,Arkusz1!$C:$C,0)),\"\",INDEX('import danych'!$H:$H,MATCH(ROW()-2,Arkusz1!$C:$C,0)+5))","v":""},{"$f":"IF(ISERROR(MATCH(ROW()-2,Arkusz1!$C:$C,0)),\"\",INDEX('import danych'!$L:$L,MATCH(ROW()-2,Arkusz1!$C:$C,0)+5))","v":""}]
[{"$f":"IF(ISERROR(MATCH(ROW()-2,Arkusz1!$C:$C,0)),\"\",INDEX(Arkusz1!C:C,MATCH(ROW()-2,Arkusz1!$C:$C,0)))","v":""},{"$f":"IF(ISERROR(MATCH(ROW()-2,Arkusz1!$C:$C,0)),\"\",INDEX('import danych'!$A:$A,MATCH(ROW()-2,Arkusz1!$C:$C,0)+5))","v":""},"",{"$f":"IF(ISERROR(MATCH(ROW()-2,Arkusz1!$C:$C,0)),\"\",INDEX('import danych'!$B:$B,MATCH(ROW()-2,Arkusz1!$C:$C,0)+5))","v":""},{"$f":"IF(ISERROR(MATCH(ROW()-2,Arkusz1!$C:$C,0)),\"\",INDEX(Arkusz1!I:I,MATCH(ROW()-2,Arkusz1!$C:$C,0)))","v":""},{"$f":"IF(ISERROR(MATCH(ROW()-2,Arkusz1!$C:$C,0)),\"\",INDEX('import danych'!$H:$H,MATCH(ROW()-2,Arkusz1!$C:$C,0)+5))","v":""},{"$f":"IF(ISERROR(MATCH(ROW()-2,Arkusz1!$C:$C,0)),\"\",INDEX('import danych'!$L:$L,MATCH(ROW()-2,Arkusz1!$C:$C,0)+5))","v":""}]
[{"$f":"IF(ISERROR(MATCH(ROW()-2,Arkusz1!$C:$C,0)),\"\",INDEX(Arkusz1!C:C,MATCH(ROW()-2,Arkusz1!$C:$C,0)))","v":""},{"$f":"IF(ISERROR(MATCH(ROW()-2,Arkusz1!$C:$C,0)),\"\",INDEX('import danych'!$A:$A,MATCH(ROW()-2,Arkusz1!$C:$C,0)+5))","v":""},"",{"$f":"IF(ISERROR(MATCH(ROW()-2,Arkusz1!$C:$C,0)),\"\",INDEX('import danych'!$B:$B,MATCH(ROW()-2,Arkusz1!$C:$C,0)+5))","v":""},{"$f":"IF(ISERROR(MATCH(ROW()-2,Arkusz1!$C:$C,0)),\"\",INDEX(Arkusz1!I:I,MATCH(ROW()-2,Arkusz1!$C:$C,0)))","v":""},{"$f":"IF(ISERROR(MATCH(ROW()-2,Arkusz1!$C:$C,0)),\"\",INDEX('import danych'!$H:$H,MATCH(ROW()-2,Arkusz1!$C:$C,0)+5))","v":""},{"$f":"IF(ISERROR(MATCH(ROW()-2,Arkusz1!$C:$C,0)),\"\",INDEX('import danych'!$L:$L,MATCH(ROW()-2,Arkusz1!$C:$C,0)+5))","v":""}]
[{"$f":"IF(ISERROR(MATCH(ROW()-2,Arkusz1!$C:$C,0)),\"\",INDEX(Arkusz1!C:C,MATCH(ROW()-2,Arkusz1!$C:$C,0)))","v":""},{"$f":"IF(ISERROR(MATCH(ROW()-2,Arkusz1!$C:$C,0)),\"\",INDEX('import danych'!$A:$A,MATCH(ROW()-2,Arkusz1!$C:$C,0)+5))","v":""},"",{"$f":"IF(ISERROR(MATCH(ROW()-2,Arkusz1!$C:$C,0)),\"\",INDEX('import danych'!$B:$B,MATCH(ROW()-2,Arkusz1!$C:$C,0)+5))","v":""},{"$f":"IF(ISERROR(MATCH(ROW()-2,Arkusz1!$C:$C,0)),\"\",INDEX(Arkusz1!I:I,MATCH(ROW()-2,Arkusz1!$C:$C,0)))","v":""},{"$f":"IF(ISERROR(MATCH(ROW()-2,Arkusz1!$C:$C,0)),\"\",INDEX('import danych'!$H:$H,MATCH(ROW()-2,Arkusz1!$C:$C,0)+5))","v":""},{"$f":"IF(ISERROR(MATCH(ROW()-2,Arkusz1!$C:$C,0)),\"\",INDEX('import danych'!$L:$L,MATCH(ROW()-2,Arkusz1!$C:$C,0)+5))","v":""}]
[{"$f":"IF(ISERROR(MATCH(ROW()-2,Arkusz1!$C:$C,0)),\"\",INDEX(Arkusz1!C:C,MATCH(ROW()-2,Arkusz1!$C:$C,0)))","v":""},{"$f":"IF(ISERROR(MATCH(ROW()-2,Arkusz1!$C:$C,0)),\"\",INDEX('import danych'!$A:$A,MATCH(ROW()-2,Arkusz1!$C:$C,0)+5))","v":""},"",{"$f":"IF(ISERROR(MATCH(ROW()-2,Arkusz1!$C:$C,0)),\"\",INDEX('import danych'!$B:$B,MATCH(ROW()-2,Arkusz1!$C:$C,0)+5))","v":""},{"$f":"IF(ISERROR(MATCH(ROW()-2,Arkusz1!$C:$C,0)),\"\",INDEX(Arkusz1!I:I,MATCH(ROW()-2,Arkusz1!$C:$C,0)))","v":""},{"$f":"IF(ISERROR(MATCH(ROW()-2,Arkusz1!$C:$C,0)),\"\",INDEX('import danych'!$H:$H,MATCH(ROW()-2,Arkusz1!$C:$C,0)+5))","v":""},{"$f":"IF(ISERROR(MATCH(ROW()-2,Arkusz1!$C:$C,0)),\"\",INDEX('import danych'!$L:$L,MATCH(ROW()-2,Arkusz1!$C:$C,0)+5))","v":""}]
[{"$f":"IF(ISERROR(MATCH(ROW()-2,Arkusz1!$C:$C,0)),\"\",INDEX(Arkusz1!C:C,MATCH(ROW()-2,Arkusz1!$C:$C,0)))","v":""},{"$f":"IF(ISERROR(MATCH(ROW()-2,Arkusz1!$C:$C,0)),\"\",INDEX('import danych'!$A:$A,MATCH(ROW()-2,Arkusz1!$C:$C,0)+5))","v":""},"",{"$f":"IF(ISERROR(MATCH(ROW()-2,Arkusz1!$C:$C,0)),\"\",INDEX('import danych'!$B:$B,MATCH(ROW()-2,Arkusz1!$C:$C,0)+5))","v":""},{"$f":"IF(ISERROR(MATCH(ROW()-2,Arkusz1!$C:$C,0)),\"\",INDEX(Arkusz1!I:I,MATCH(ROW()-2,Arkusz1!$C:$C,0)))","v":""},{"$f":"IF(ISERROR(MATCH(ROW()-2,Arkusz1!$C:$C,0)),\"\",INDEX('import danych'!$H:$H,MATCH(ROW()-2,Arkusz1!$C:$C,0)+5))","v":""},{"$f":"IF(ISERROR(MATCH(ROW()-2,Arkusz1!$C:$C,0)),\"\",INDEX('import danych'!$L:$L,MATCH(ROW()-2,Arkusz1!$C:$C,0)+5))","v":""}]
[{"$f":"IF(ISERROR(MATCH(ROW()-2,Arkusz1!$C:$C,0)),\"\",INDEX(Arkusz1!C:C,MATCH(ROW()-2,Arkusz1!$C:$C,0)))","v":""},{"$f":"IF(ISERROR(MATCH(ROW()-2,Arkusz1!$C:$C,0)),\"\",INDEX('import danych'!$A:$A,MATCH(ROW()-2,Arkusz1!$C:$C,0)+5))","v":""},"",{"$f":"IF(ISERROR(MATCH(ROW()-2,Arkusz1!$C:$C,0)),\"\",INDEX('import danych'!$B:$B,MATCH(ROW()-2,Arkusz1!$C:$C,0)+5))","v":""},{"$f":"IF(ISERROR(MATCH(ROW()-2,Arkusz1!$C:$C,0)),\"\",INDEX(Arkusz1!I:I,MATCH(ROW()-2,Arkusz1!$C:$C,0)))","v":""},{"$f":"IF(ISERROR(MATCH(ROW()-2,Arkusz1!$C:$C,0)),\"\",INDEX('import danych'!$H:$H,MATCH(ROW()-2,Arkusz1!$C:$C,0)+5))","v":""},{"$f":"IF(ISERROR(MATCH(ROW()-2,Arkusz1!$C:$C,0)),\"\",INDEX('import danych'!$L:$L,MATCH(ROW()-2,Arkusz1!$C:$C,0)+5))","v":""}]
[{"$f":"IF(ISERROR(MATCH(ROW()-2,Arkusz1!$C:$C,0)),\"\",INDEX(Arkusz1!C:C,MATCH(ROW()-2,Arkusz1!$C:$C,0)))","v":""},{"$f":"IF(ISERROR(MATCH(ROW()-2,Arkusz1!$C:$C,0)),\"\",INDEX('import danych'!$A:$A,MATCH(ROW()-2,Arkusz1!$C:$C,0)+5))","v":""},"",{"$f":"IF(ISERROR(MATCH(ROW()-2,Arkusz1!$C:$C,0)),\"\",INDEX('import danych'!$B:$B,MATCH(ROW()-2,Arkusz1!$C:$C,0)+5))","v":""},{"$f":"IF(ISERROR(MATCH(ROW()-2,Arkusz1!$C:$C,0)),\"\",INDEX(Arkusz1!I:I,MATCH(ROW()-2,Arkusz1!$C:$C,0)))","v":""},{"$f":"IF(ISERROR(MATCH(ROW()-2,Arkusz1!$C:$C,0)),\"\",INDEX('import danych'!$H:$H,MATCH(ROW()-2,Arkusz1!$C:$C,0)+5))","v":""},{"$f":"IF(ISERROR(MATCH(ROW()-2,Arkusz1!$C:$C,0)),\"\",INDEX('import danych'!$L:$L,MATCH(ROW()-2,Arkusz1!$C:$C,0)+5))","v":""}]
[{"$f":"IF(ISERROR(MATCH(ROW()-2,Arkusz1!$C:$C,0)),\"\",INDEX(Arkusz1!C:C,MATCH(ROW()-2,Arkusz1!$C:$C,0)))","v":""},{"$f":"IF(ISERROR(MATCH(ROW()-2,Arkusz1!$C:$C,0)),\"\",INDEX('import danych'!$A:$A,MATCH(ROW()-2,Arkusz1!$C:$C,0)+5))","v":""},"",{"$f":"IF(ISERROR(MATCH(ROW()-2,Arkusz1!$C:$C,0)),\"\",INDEX('import danych'!$B:$B,MATCH(ROW()-2,Arkusz1!$C:$C,0)+5))","v":""},{"$f":"IF(ISERROR(MATCH(ROW()-2,Arkusz1!$C:$C,0)),\"\",INDEX(Arkusz1!I:I,MATCH(ROW()-2,Arkusz1!$C:$C,0)))","v":""},{"$f":"IF(ISERROR(MATCH(ROW()-2,Arkusz1!$C:$C,0)),\"\",INDEX('import danych'!$H:$H,MATCH(ROW()-2,Arkusz1!$C:$C,0)+5))","v":""},{"$f":"IF(ISERROR(MATCH(ROW()-2,Arkusz1!$C:$C,0)),\"\",INDEX('import danych'!$L:$L,MATCH(ROW()-2,Arkusz1!$C:$C,0)+5))","v":""}]
[{"$f":"IF(ISERROR(MATCH(ROW()-2,Arkusz1!$C:$C,0)),\"\",INDEX(Arkusz1!C:C,MATCH(ROW()-2,Arkusz1!$C:$C,0)))","v":""},{"$f":"IF(ISERROR(MATCH(ROW()-2,Arkusz1!$C:$C,0)),\"\",INDEX('import danych'!$A:$A,MATCH(ROW()-2,Arkusz1!$C:$C,0)+5))","v":""},"",{"$f":"IF(ISERROR(MATCH(ROW()-2,Arkusz1!$C:$C,0)),\"\",INDEX('import danych'!$B:$B,MATCH(ROW()-2,Arkusz1!$C:$C,0)+5))","v":""},{"$f":"IF(ISERROR(MATCH(ROW()-2,Arkusz1!$C:$C,0)),\"\",INDEX(Arkusz1!I:I,MATCH(ROW()-2,Arkusz1!$C:$C,0)))","v":""},{"$f":"IF(ISERROR(MATCH(ROW()-2,Arkusz1!$C:$C,0)),\"\",INDEX('import danych'!$H:$H,MATCH(ROW()-2,Arkusz1!$C:$C,0)+5))","v":""},{"$f":"IF(ISERROR(MATCH(ROW()-2,Arkusz1!$C:$C,0)),\"\",INDEX('import danych'!$L:$L,MATCH(ROW()-2,Arkusz1!$C:$C,0)+5))","v":""}]
[{"$f":"IF(ISERROR(MATCH(ROW()-2,Arkusz1!$C:$C,0)),\"\",INDEX(Arkusz1!C:C,MATCH(ROW()-2,Arkusz1!$C:$C,0)))","v":""},{"$f":"IF(ISERROR(MATCH(ROW()-2,Arkusz1!$C:$C,0)),\"\",INDEX('import danych'!$A:$A,MATCH(ROW()-2,Arkusz1!$C:$C,0)+5))","v":""},"",{"$f":"IF(ISERROR(MATCH(ROW()-2,Arkusz1!$C:$C,0)),\"\",INDEX('import danych'!$B:$B,MATCH(ROW()-2,Arkusz1!$C:$C,0)+5))","v":""},{"$f":"IF(ISERROR(MATCH(ROW()-2,Arkusz1!$C:$C,0)),\"\",INDEX(Arkusz1!I:I,MATCH(ROW()-2,Arkusz1!$C:$C,0)))","v":""},{"$f":"IF(ISERROR(MATCH(ROW()-2,Arkusz1!$C:$C,0)),\"\",INDEX('import danych'!$H:$H,MATCH(ROW()-2,Arkusz1!$C:$C,0)+5))","v":""},{"$f":"IF(ISERROR(MATCH(ROW()-2,Arkusz1!$C:$C,0)),\"\",INDEX('import danych'!$L:$L,MATCH(ROW()-2,Arkusz1!$C:$C,0)+5))","v":""}]
[{"$f":"IF(ISERROR(MATCH(ROW()-2,Arkusz1!$C:$C,0)),\"\",INDEX(Arkusz1!C:C,MATCH(ROW()-2,Arkusz1!$C:$C,0)))","v":""},{"$f":"IF(ISERROR(MATCH(ROW()-2,Arkusz1!$C:$C,0)),\"\",INDEX('import danych'!$A:$A,MATCH(ROW()-2,Arkusz1!$C:$C,0)+5))","v":""},"",{"$f":"IF(ISERROR(MATCH(ROW()-2,Arkusz1!$C:$C,0)),\"\",INDEX('import danych'!$B:$B,MATCH(ROW()-2,Arkusz1!$C:$C,0)+5))","v":""},{"$f":"IF(ISERROR(MATCH(ROW()-2,Arkusz1!$C:$C,0)),\"\",INDEX(Arkusz1!I:I,MATCH(ROW()-2,Arkusz1!$C:$C,0)))","v":""},{"$f":"IF(ISERROR(MATCH(ROW()-2,Arkusz1!$C:$C,0)),\"\",INDEX('import danych'!$H:$H,MATCH(ROW()-2,Arkusz1!$C:$C,0)+5))","v":""},{"$f":"IF(ISERROR(MATCH(ROW()-2,Arkusz1!$C:$C,0)),\"\",INDEX('import danych'!$L:$L,MATCH(ROW()-2,Arkusz1!$C:$C,0)+5))","v":""}]
[{"$f":"IF(ISERROR(MATCH(ROW()-2,Arkusz1!$C:$C,0)),\"\",INDEX(Arkusz1!C:C,MATCH(ROW()-2,Arkusz1!$C:$C,0)))","v":""},{"$f":"IF(ISERROR(MATCH(ROW()-2,Arkusz1!$C:$C,0)),\"\",INDEX('import danych'!$A:$A,MATCH(ROW()-2,Arkusz1!$C:$C,0)+5))","v":""},"",{"$f":"IF(ISERROR(MATCH(ROW()-2,Arkusz1!$C:$C,0)),\"\",INDEX('import danych'!$B:$B,MATCH(ROW()-2,Arkusz1!$C:$C,0)+5))","v":""},{"$f":"IF(ISERROR(MATCH(ROW()-2,Arkusz1!$C:$C,0)),\"\",INDEX(Arkusz1!I:I,MATCH(ROW()-2,Arkusz1!$C:$C,0)))","v":""},{"$f":"IF(ISERROR(MATCH(ROW()-2,Arkusz1!$C:$C,0)),\"\",INDEX('import danych'!$H:$H,MATCH(ROW()-2,Arkusz1!$C:$C,0)+5))","v":""},{"$f":"IF(ISERROR(MATCH(ROW()-2,Arkusz1!$C:$C,0)),\"\",INDEX('import danych'!$L:$L,MATCH(ROW()-2,Arkusz1!$C:$C,0)+5))","v":""}]
[{"$f":"IF(ISERROR(MATCH(ROW()-2,Arkusz1!$C:$C,0)),\"\",INDEX(Arkusz1!C:C,MATCH(ROW()-2,Arkusz1!$C:$C,0)))","v":""},{"$f":"IF(ISERROR(MATCH(ROW()-2,Arkusz1!$C:$C,0)),\"\",INDEX('import danych'!$A:$A,MATCH(ROW()-2,Arkusz1!$C:$C,0)+5))","v":""},"",{"$f":"IF(ISERROR(MATCH(ROW()-2,Arkusz1!$C:$C,0)),\"\",INDEX('import danych'!$B:$B,MATCH(ROW()-2,Arkusz1!$C:$C,0)+5))","v":""},{"$f":"IF(ISERROR(MATCH(ROW()-2,Arkusz1!$C:$C,0)),\"\",INDEX(Arkusz1!I:I,MATCH(ROW()-2,Arkusz1!$C:$C,0)))","v":""},{"$f":"IF(ISERROR(MATCH(ROW()-2,Arkusz1!$C:$C,0)),\"\",INDEX('import danych'!$H:$H,MATCH(ROW()-2,Arkusz1!$C:$C,0)+5))","v":""},{"$f":"IF(ISERROR(MATCH(ROW()-2,Arkusz1!$C:$C,0)),\"\",INDEX('import danych'!$L:$L,MATCH(ROW()-2,Arkusz1!$C:$C,0)+5))","v":""}]
[{"$f":"IF(ISERROR(MATCH(ROW()-2,Arkusz1!$C:$C,0)),\"\",INDEX(Arkusz1!C:C,MATCH(ROW()-2,Arkusz1!$C:$C,0)))","v":""},{"$f":"IF(ISERROR(MATCH(ROW()-2,Arkusz1!$C:$C,0)),\"\",INDEX('import danych'!$A:$A,MATCH(ROW()-2,Arkusz1!$C:$C,0)+5))","v":""},"",{"$f":"IF(ISERROR(MATCH(ROW()-2,Arkusz1!$C:$C,0)),\"\",INDEX('import danych'!$B:$B,MATCH(ROW()-2,Arkusz1!$C:$C,0)+5))","v":""},{"$f":"IF(ISERROR(MATCH(ROW()-2,Arkusz1!$C:$C,0)),\"\",INDEX(Arkusz1!I:I,MATCH(ROW()-2,Arkusz1!$C:$C,0)))","v":""},{"$f":"IF(ISERROR(MATCH(ROW()-2,Arkusz1!$C:$C,0)),\"\",INDEX('import danych'!$H:$H,MATCH(ROW()-2,Arkusz1!$C:$C,0)+5))","v":""},{"$f":"IF(ISERROR(MATCH(ROW()-2,Arkusz1!$C:$C,0)),\"\",INDEX('import danych'!$L:$L,MATCH(ROW()-2,Arkusz1!$C:$C,0)+5))","v":""}]
[{"$f":"IF(ISERROR(MATCH(ROW()-2,Arkusz1!$C:$C,0)),\"\",INDEX(Arkusz1!C:C,MATCH(ROW()-2,Arkusz1!$C:$C,0)))","v":""},{"$f":"IF(ISERROR(MATCH(ROW()-2,Arkusz1!$C:$C,0)),\"\",INDEX('import danych'!$A:$A,MATCH(ROW()-2,Arkusz1!$C:$C,0)+5))","v":""},"",{"$f":"IF(ISERROR(MATCH(ROW()-2,Arkusz1!$C:$C,0)),\"\",INDEX('import danych'!$B:$B,MATCH(ROW()-2,Arkusz1!$C:$C,0)+5))","v":""},{"$f":"IF(ISERROR(MATCH(ROW()-2,Arkusz1!$C:$C,0)),\"\",INDEX(Arkusz1!I:I,MATCH(ROW()-2,Arkusz1!$C:$C,0)))","v":""},{"$f":"IF(ISERROR(MATCH(ROW()-2,Arkusz1!$C:$C,0)),\"\",INDEX('import danych'!$H:$H,MATCH(ROW()-2,Arkusz1!$C:$C,0)+5))","v":""},{"$f":"IF(ISERROR(MATCH(ROW()-2,Arkusz1!$C:$C,0)),\"\",INDEX('import danych'!$L:$L,MATCH(ROW()-2,Arkusz1!$C:$C,0)+5))","v":""}]
[{"$f":"IF(ISERROR(MATCH(ROW()-2,Arkusz1!$C:$C,0)),\"\",INDEX(Arkusz1!C:C,MATCH(ROW()-2,Arkusz1!$C:$C,0)))","v":""},{"$f":"IF(ISERROR(MATCH(ROW()-2,Arkusz1!$C:$C,0)),\"\",INDEX('import danych'!$A:$A,MATCH(ROW()-2,Arkusz1!$C:$C,0)+5))","v":""},"",{"$f":"IF(ISERROR(MATCH(ROW()-2,Arkusz1!$C:$C,0)),\"\",INDEX('import danych'!$B:$B,MATCH(ROW()-2,Arkusz1!$C:$C,0)+5))","v":""},{"$f":"IF(ISERROR(MATCH(ROW()-2,Arkusz1!$C:$C,0)),\"\",INDEX(Arkusz1!I:I,MATCH(ROW()-2,Arkusz1!$C:$C,0)))","v":""},{"$f":"IF(ISERROR(MATCH(ROW()-2,Arkusz1!$C:$C,0)),\"\",INDEX('import danych'!$H:$H,MATCH(ROW()-2,Arkusz1!$C:$C,0)+5))","v":""},{"$f":"IF(ISERROR(MATCH(ROW()-2,Arkusz1!$C:$C,0)),\"\",INDEX('import danych'!$L:$L,MATCH(ROW()-2,Arkusz1!$C:$C,0)+5))","v":""}]
[{"$f":"IF(ISERROR(MATCH(ROW()-2,Arkusz1!$C:$C,0)),\"\",INDEX(Arkusz1!C:C,MATCH(ROW()-2,Arkusz1!$C:$C,0)))","v":""},{"$f":"IF(ISERROR(MATCH(ROW()-2,Arkusz1!$C:$C,0)),\"\",INDEX('import danych'!$A:$A,MATCH(ROW()-2,Arkusz1!$C:$C,0)+5))","v":""},"",{"$f":"IF(ISERROR(MATCH(ROW()-2,Arkusz1!$C:$C,0)),\"\",INDEX('import danych'!$B:$B,MATCH(ROW()-2,Arkusz1!$C:$C,0)+5))","v":""},{"$f":"IF(ISERROR(MATCH(ROW()-2,Arkusz1!$C:$C,0)),\"\",INDEX(Arkusz1!I:I,MATCH(ROW()-2,Arkusz1!$C:$C,0)))","v":""},{"$f":"IF(ISERROR(MATCH(ROW()-2,Arkusz1!$C:$C,0)),\"\",INDEX('import danych'!$H:$H,MATCH(ROW()-2,Arkusz1!$C:$C,0)+5))","v":""},{"$f":"IF(ISERROR(MATCH(ROW()-2,Arkusz1!$C:$C,0)),\"\",INDEX('import danych'!$L:$L,MATCH(ROW()-2,Arkusz1!$C:$C,0)+5))","v":""}]
[{"$f":"IF(ISERROR(MATCH(ROW()-2,Arkusz1!$C:$C,0)),\"\",INDEX(Arkusz1!C:C,MATCH(ROW()-2,Arkusz1!$C:$C,0)))","v":""},{"$f":"IF(ISERROR(MATCH(ROW()-2,Arkusz1!$C:$C,0)),\"\",INDEX('import danych'!$A:$A,MATCH(ROW()-2,Arkusz1!$C:$C,0)+5))","v":""},"",{"$f":"IF(ISERROR(MATCH(ROW()-2,Arkusz1!$C:$C,0)),\"\",INDEX('import danych'!$B:$B,MATCH(ROW()-2,Arkusz1!$C:$C,0)+5))","v":""},{"$f":"IF(ISERROR(MATCH(ROW()-2,Arkusz1!$C:$C,0)),\"\",INDEX(Arkusz1!I:I,MATCH(ROW()-2,Arkusz1!$C:$C,0)))","v":""},{"$f":"IF(ISERROR(MATCH(ROW()-2,Arkusz1!$C:$C,0)),\"\",INDEX('import danych'!$H:$H,MATCH(ROW()-2,Arkusz1!$C:$C,0)+5))","v":""},{"$f":"IF(ISERROR(MATCH(ROW()-2,Arkusz1!$C:$C,0)),\"\",INDEX('import danych'!$L:$L,MATCH(ROW()-2,Arkusz1!$C:$C,0)+5))","v":""}]
[{"$f":"IF(ISERROR(MATCH(ROW()-2,Arkusz1!$C:$C,0)),\"\",INDEX(Arkusz1!C:C,MATCH(ROW()-2,Arkusz1!$C:$C,0)))","v":""},{"$f":"IF(ISERROR(MATCH(ROW()-2,Arkusz1!$C:$C,0)),\"\",INDEX('import danych'!$A:$A,MATCH(ROW()-2,Arkusz1!$C:$C,0)+5))","v":""},"",{"$f":"IF(ISERROR(MATCH(ROW()-2,Arkusz1!$C:$C,0)),\"\",INDEX('import danych'!$B:$B,MATCH(ROW()-2,Arkusz1!$C:$C,0)+5))","v":""},{"$f":"IF(ISERROR(MATCH(ROW()-2,Arkusz1!$C:$C,0)),\"\",INDEX(Arkusz1!I:I,MATCH(ROW()-2,Arkusz1!$C:$C,0)))","v":""},{"$f":"IF(ISERROR(MATCH(ROW()-2,Arkusz1!$C:$C,0)),\"\",INDEX('import danych'!$H:$H,MATCH(ROW()-2,Arkusz1!$C:$C,0)+5))","v":""},{"$f":"IF(ISERROR(MATCH(ROW()-2,Arkusz1!$C:$C,0)),\"\",INDEX('import danych'!$L:$L,MATCH(ROW()-2,Arkusz1!$C:$C,0)+5))","v":""}]
[{"$f":"IF(ISERROR(MATCH(ROW()-2,Arkusz1!$C:$C,0)),\"\",INDEX(Arkusz1!C:C,MATCH(ROW()-2,Arkusz1!$C:$C,0)))","v":""},{"$f":"IF(ISERROR(MATCH(ROW()-2,Arkusz1!$C:$C,0)),\"\",INDEX('import danych'!$A:$A,MATCH(ROW()-2,Arkusz1!$C:$C,0)+5))","v":""},"",{"$f":"IF(ISERROR(MATCH(ROW()-2,Arkusz1!$C:$C,0)),\"\",INDEX('import danych'!$B:$B,MATCH(ROW()-2,Arkusz1!$C:$C,0)+5))","v":""},{"$f":"IF(ISERROR(MATCH(ROW()-2,Arkusz1!$C:$C,0)),\"\",INDEX(Arkusz1!I:I,MATCH(ROW()-2,Arkusz1!$C:$C,0)))","v":""},{"$f":"IF(ISERROR(MATCH(ROW()-2,Arkusz1!$C:$C,0)),\"\",INDEX('import danych'!$H:$H,MATCH(ROW()-2,Arkusz1!$C:$C,0)+5))","v":""},{"$f":"IF(ISERROR(MATCH(ROW()-2,Arkusz1!$C:$C,0)),\"\",INDEX('import danych'!$L:$L,MATCH(ROW()-2,Arkusz1!$C:$C,0)+5))","v":""}]
[{"$f":"IF(ISERROR(MATCH(ROW()-2,Arkusz1!$C:$C,0)),\"\",INDEX(Arkusz1!C:C,MATCH(ROW()-2,Arkusz1!$C:$C,0)))","v":""},{"$f":"IF(ISERROR(MATCH(ROW()-2,Arkusz1!$C:$C,0)),\"\",INDEX('import danych'!$A:$A,MATCH(ROW()-2,Arkusz1!$C:$C,0)+5))","v":""},{"$f":"IF(A132=\"\",\"\",DATEVALUE(B132))","v":""},{"$f":"IF(ISERROR(MATCH(ROW()-2,Arkusz1!$C:$C,0)),\"\",INDEX('import danych'!$B:$B,MATCH(ROW()-2,Arkusz1!$C:$C,0)+5))","v":""},{"$f":"IF(ISERROR(MATCH(ROW()-2,Arkusz1!$C:$C,0)),\"\",INDEX(Arkusz1!I:I,MATCH(ROW()-2,Arkusz1!$C:$C,0)))","v":""},{"$f":"IF(ISERROR(MATCH(ROW()-2,Arkusz1!$C:$C,0)),\"\",INDEX('import danych'!$H:$H,MATCH(ROW()-2,Arkusz1!$C:$C,0)+5))","v":""},{"$f":"IF(ISERROR(MATCH(ROW()-2,Arkusz1!$C:$C,0)),\"\",INDEX('import danych'!$L:$L,MATCH(ROW()-2,Arkusz1!$C:$C,0)+5))","v":""}]
[{"$f":"IF(ISERROR(MATCH(ROW()-2,Arkusz1!$C:$C,0)),\"\",INDEX(Arkusz1!C:C,MATCH(ROW()-2,Arkusz1!$C:$C,0)))","v":""},{"$f":"IF(ISERROR(MATCH(ROW()-2,Arkusz1!$C:$C,0)),\"\",INDEX('import danych'!$A:$A,MATCH(ROW()-2,Arkusz1!$C:$C,0)+5))","v":""},"",{"$f":"IF(ISERROR(MATCH(ROW()-2,Arkusz1!$C:$C,0)),\"\",INDEX('import danych'!$B:$B,MATCH(ROW()-2,Arkusz1!$C:$C,0)+5))","v":""},{"$f":"IF(ISERROR(MATCH(ROW()-2,Arkusz1!$C:$C,0)),\"\",INDEX(Arkusz1!I:I,MATCH(ROW()-2,Arkusz1!$C:$C,0)))","v":""},{"$f":"IF(ISERROR(MATCH(ROW()-2,Arkusz1!$C:$C,0)),\"\",INDEX('import danych'!$H:$H,MATCH(ROW()-2,Arkusz1!$C:$C,0)+5))","v":""},{"$f":"IF(ISERROR(MATCH(ROW()-2,Arkusz1!$C:$C,0)),\"\",INDEX('import danych'!$L:$L,MATCH(ROW()-2,Arkusz1!$C:$C,0)+5))","v":""}]
[{"$f":"IF(ISERROR(MATCH(ROW()-2,Arkusz1!$C:$C,0)),\"\",INDEX(Arkusz1!C:C,MATCH(ROW()-2,Arkusz1!$C:$C,0)))","v":""},{"$f":"IF(ISERROR(MATCH(ROW()-2,Arkusz1!$C:$C,0)),\"\",INDEX('import danych'!$A:$A,MATCH(ROW()-2,Arkusz1!$C:$C,0)+5))","v":""},"",{"$f":"IF(ISERROR(MATCH(ROW()-2,Arkusz1!$C:$C,0)),\"\",INDEX('import danych'!$B:$B,MATCH(ROW()-2,Arkusz1!$C:$C,0)+5))","v":""},{"$f":"IF(ISERROR(MATCH(ROW()-2,Arkusz1!$C:$C,0)),\"\",INDEX(Arkusz1!I:I,MATCH(ROW()-2,Arkusz1!$C:$C,0)))","v":""},{"$f":"IF(ISERROR(MATCH(ROW()-2,Arkusz1!$C:$C,0)),\"\",INDEX('import danych'!$H:$H,MATCH(ROW()-2,Arkusz1!$C:$C,0)+5))","v":""},{"$f":"IF(ISERROR(MATCH(ROW()-2,Arkusz1!$C:$C,0)),\"\",INDEX('import danych'!$L:$L,MATCH(ROW()-2,Arkusz1!$C:$C,0)+5))","v":""}]
[{"$f":"IF(ISERROR(MATCH(ROW()-2,Arkusz1!$C:$C,0)),\"\",INDEX(Arkusz1!C:C,MATCH(ROW()-2,Arkusz1!$C:$C,0)))","v":""},{"$f":"IF(ISERROR(MATCH(ROW()-2,Arkusz1!$C:$C,0)),\"\",INDEX('import danych'!$A:$A,MATCH(ROW()-2,Arkusz1!$C:$C,0)+5))","v":""},"",{"$f":"IF(ISERROR(MATCH(ROW()-2,Arkusz1!$C:$C,0)),\"\",INDEX('import danych'!$B:$B,MATCH(ROW()-2,Arkusz1!$C:$C,0)+5))","v":""},{"$f":"IF(ISERROR(MATCH(ROW()-2,Arkusz1!$C:$C,0)),\"\",INDEX(Arkusz1!I:I,MATCH(ROW()-2,Arkusz1!$C:$C,0)))","v":""},{"$f":"IF(ISERROR(MATCH(ROW()-2,Arkusz1!$C:$C,0)),\"\",INDEX('import danych'!$H:$H,MATCH(ROW()-2,Arkusz1!$C:$C,0)+5))","v":""},{"$f":"IF(ISERROR(MATCH(ROW()-2,Arkusz1!$C:$C,0)),\"\",INDEX('import danych'!$L:$L,MATCH(ROW()-2,Arkusz1!$C:$C,0)+5))","v":""}]
[{"$f":"IF(ISERROR(MATCH(ROW()-2,Arkusz1!$C:$C,0)),\"\",INDEX(Arkusz1!C:C,MATCH(ROW()-2,Arkusz1!$C:$C,0)))","v":""},{"$f":"IF(ISERROR(MATCH(ROW()-2,Arkusz1!$C:$C,0)),\"\",INDEX('import danych'!$A:$A,MATCH(ROW()-2,Arkusz1!$C:$C,0)+5))","v":""},"",{"$f":"IF(ISERROR(MATCH(ROW()-2,Arkusz1!$C:$C,0)),\"\",INDEX('import danych'!$B:$B,MATCH(ROW()-2,Arkusz1!$C:$C,0)+5))","v":""},{"$f":"IF(ISERROR(MATCH(ROW()-2,Arkusz1!$C:$C,0)),\"\",INDEX(Arkusz1!I:I,MATCH(ROW()-2,Arkusz1!$C:$C,0)))","v":""},{"$f":"IF(ISERROR(MATCH(ROW()-2,Arkusz1!$C:$C,0)),\"\",INDEX('import danych'!$H:$H,MATCH(ROW()-2,Arkusz1!$C:$C,0)+5))","v":""},{"$f":"IF(ISERROR(MATCH(ROW()-2,Arkusz1!$C:$C,0)),\"\",INDEX('import danych'!$L:$L,MATCH(ROW()-2,Arkusz1!$C:$C,0)+5))","v":""}]
[{"$f":"IF(ISERROR(MATCH(ROW()-2,Arkusz1!$C:$C,0)),\"\",INDEX(Arkusz1!C:C,MATCH(ROW()-2,Arkusz1!$C:$C,0)))","v":""},{"$f":"IF(ISERROR(MATCH(ROW()-2,Arkusz1!$C:$C,0)),\"\",INDEX('import danych'!$A:$A,MATCH(ROW()-2,Arkusz1!$C:$C,0)+5))","v":""},"",{"$f":"IF(ISERROR(MATCH(ROW()-2,Arkusz1!$C:$C,0)),\"\",INDEX('import danych'!$B:$B,MATCH(ROW()-2,Arkusz1!$C:$C,0)+5))","v":""},{"$f":"IF(ISERROR(MATCH(ROW()-2,Arkusz1!$C:$C,0)),\"\",INDEX(Arkusz1!I:I,MATCH(ROW()-2,Arkusz1!$C:$C,0)))","v":""},{"$f":"IF(ISERROR(MATCH(ROW()-2,Arkusz1!$C:$C,0)),\"\",INDEX('import danych'!$H:$H,MATCH(ROW()-2,Arkusz1!$C:$C,0)+5))","v":""},{"$f":"IF(ISERROR(MATCH(ROW()-2,Arkusz1!$C:$C,0)),\"\",INDEX('import danych'!$L:$L,MATCH(ROW()-2,Arkusz1!$C:$C,0)+5))","v":""}]
[{"$f":"IF(ISERROR(MATCH(ROW()-2,Arkusz1!$C:$C,0)),\"\",INDEX(Arkusz1!C:C,MATCH(ROW()-2,Arkusz1!$C:$C,0)))","v":""},{"$f":"IF(ISERROR(MATCH(ROW()-2,Arkusz1!$C:$C,0)),\"\",INDEX('import danych'!$A:$A,MATCH(ROW()-2,Arkusz1!$C:$C,0)+5))","v":""},"",{"$f":"IF(ISERROR(MATCH(ROW()-2,Arkusz1!$C:$C,0)),\"\",INDEX('import danych'!$B:$B,MATCH(ROW()-2,Arkusz1!$C:$C,0)+5))","v":""},{"$f":"IF(ISERROR(MATCH(ROW()-2,Arkusz1!$C:$C,0)),\"\",INDEX(Arkusz1!I:I,MATCH(ROW()-2,Arkusz1!$C:$C,0)))","v":""},{"$f":"IF(ISERROR(MATCH(ROW()-2,Arkusz1!$C:$C,0)),\"\",INDEX('import danych'!$H:$H,MATCH(ROW()-2,Arkusz1!$C:$C,0)+5))","v":""},{"$f":"IF(ISERROR(MATCH(ROW()-2,Arkusz1!$C:$C,0)),\"\",INDEX('import danych'!$L:$L,MATCH(ROW()-2,Arkusz1!$C:$C,0)+5))","v":""}]
[{"$f":"IF(ISERROR(MATCH(ROW()-2,Arkusz1!$C:$C,0)),\"\",INDEX(Arkusz1!C:C,MATCH(ROW()-2,Arkusz1!$C:$C,0)))","v":""},{"$f":"IF(ISERROR(MATCH(ROW()-2,Arkusz1!$C:$C,0)),\"\",INDEX('import danych'!$A:$A,MATCH(ROW()-2,Arkusz1!$C:$C,0)+5))","v":""},"",{"$f":"IF(ISERROR(MATCH(ROW()-2,Arkusz1!$C:$C,0)),\"\",INDEX('import danych'!$B:$B,MATCH(ROW()-2,Arkusz1!$C:$C,0)+5))","v":""},{"$f":"IF(ISERROR(MATCH(ROW()-2,Arkusz1!$C:$C,0)),\"\",INDEX(Arkusz1!I:I,MATCH(ROW()-2,Arkusz1!$C:$C,0)))","v":""},{"$f":"IF(ISERROR(MATCH(ROW()-2,Arkusz1!$C:$C,0)),\"\",INDEX('import danych'!$H:$H,MATCH(ROW()-2,Arkusz1!$C:$C,0)+5))","v":""},{"$f":"IF(ISERROR(MATCH(ROW()-2,Arkusz1!$C:$C,0)),\"\",INDEX('import danych'!$L:$L,MATCH(ROW()-2,Arkusz1!$C:$C,0)+5))","v":""}]
[{"$f":"IF(ISERROR(MATCH(ROW()-2,Arkusz1!$C:$C,0)),\"\",INDEX(Arkusz1!C:C,MATCH(ROW()-2,Arkusz1!$C:$C,0)))","v":""},{"$f":"IF(ISERROR(MATCH(ROW()-2,Arkusz1!$C:$C,0)),\"\",INDEX('import danych'!$A:$A,MATCH(ROW()-2,Arkusz1!$C:$C,0)+5))","v":""},"",{"$f":"IF(ISERROR(MATCH(ROW()-2,Arkusz1!$C:$C,0)),\"\",INDEX('import danych'!$B:$B,MATCH(ROW()-2,Arkusz1!$C:$C,0)+5))","v":""},{"$f":"IF(ISERROR(MATCH(ROW()-2,Arkusz1!$C:$C,0)),\"\",INDEX(Arkusz1!I:I,MATCH(ROW()-2,Arkusz1!$C:$C,0)))","v":""},{"$f":"IF(ISERROR(MATCH(ROW()-2,Arkusz1!$C:$C,0)),\"\",INDEX('import danych'!$H:$H,MATCH(ROW()-2,Arkusz1!$C:$C,0)+5))","v":""},{"$f":"IF(ISERROR(MATCH(ROW()-2,Arkusz1!$C:$C,0)),\"\",INDEX('import danych'!$L:$L,MATCH(ROW()-2,Arkusz1!$C:$C,0)+5))","v":""}]
[{"$f":"IF(ISERROR(MATCH(ROW()-2,Arkusz1!$C:$C,0)),\"\",INDEX(Arkusz1!C:C,MATCH(ROW()-2,Arkusz1!$C:$C,0)))","v":""},{"$f":"IF(ISERROR(MATCH(ROW()-2,Arkusz1!$C:$C,0)),\"\",INDEX('import danych'!$A:$A,MATCH(ROW()-2,Arkusz1!$C:$C,0)+5))","v":""},"",{"$f":"IF(ISERROR(MATCH(ROW()-2,Arkusz1!$C:$C,0)),\"\",INDEX('import danych'!$B:$B,MATCH(ROW()-2,Arkusz1!$C:$C,0)+5))","v":""},{"$f":"IF(ISERROR(MATCH(ROW()-2,Arkusz1!$C:$C,0)),\"\",INDEX(Arkusz1!I:I,MATCH(ROW()-2,Arkusz1!$C:$C,0)))","v":""},{"$f":"IF(ISERROR(MATCH(ROW()-2,Arkusz1!$C:$C,0)),\"\",INDEX('import danych'!$H:$H,MATCH(ROW()-2,Arkusz1!$C:$C,0)+5))","v":""},{"$f":"IF(ISERROR(MATCH(ROW()-2,Arkusz1!$C:$C,0)),\"\",INDEX('import danych'!$L:$L,MATCH(ROW()-2,Arkusz1!$C:$C,0)+5))","v":""}]
[{"$f":"IF(ISERROR(MATCH(ROW()-2,Arkusz1!$C:$C,0)),\"\",INDEX(Arkusz1!C:C,MATCH(ROW()-2,Arkusz1!$C:$C,0)))","v":""},{"$f":"IF(ISERROR(MATCH(ROW()-2,Arkusz1!$C:$C,0)),\"\",INDEX('import danych'!$A:$A,MATCH(ROW()-2,Arkusz1!$C:$C,0)+5))","v":""},"",{"$f":"IF(ISERROR(MATCH(ROW()-2,Arkusz1!$C:$C,0)),\"\",INDEX('import danych'!$B:$B,MATCH(ROW()-2,Arkusz1!$C:$C,0)+5))","v":""},{"$f":"IF(ISERROR(MATCH(ROW()-2,Arkusz1!$C:$C,0)),\"\",INDEX(Arkusz1!I:I,MATCH(ROW()-2,Arkusz1!$C:$C,0)))","v":""},{"$f":"IF(ISERROR(MATCH(ROW()-2,Arkusz1!$C:$C,0)),\"\",INDEX('import danych'!$H:$H,MATCH(ROW()-2,Arkusz1!$C:$C,0)+5))","v":""},{"$f":"IF(ISERROR(MATCH(ROW()-2,Arkusz1!$C:$C,0)),\"\",INDEX('import danych'!$L:$L,MATCH(ROW()-2,Arkusz1!$C:$C,0)+5))","v":""}]
[{"$f":"IF(ISERROR(MATCH(ROW()-2,Arkusz1!$C:$C,0)),\"\",INDEX(Arkusz1!C:C,MATCH(ROW()-2,Arkusz1!$C:$C,0)))","v":""},{"$f":"IF(ISERROR(MATCH(ROW()-2,Arkusz1!$C:$C,0)),\"\",INDEX('import danych'!$A:$A,MATCH(ROW()-2,Arkusz1!$C:$C,0)+5))","v":""},"",{"$f":"IF(ISERROR(MATCH(ROW()-2,Arkusz1!$C:$C,0)),\"\",INDEX('import danych'!$B:$B,MATCH(ROW()-2,Arkusz1!$C:$C,0)+5))","v":""},{"$f":"IF(ISERROR(MATCH(ROW()-2,Arkusz1!$C:$C,0)),\"\",INDEX(Arkusz1!I:I,MATCH(ROW()-2,Arkusz1!$C:$C,0)))","v":""},{"$f":"IF(ISERROR(MATCH(ROW()-2,Arkusz1!$C:$C,0)),\"\",INDEX('import danych'!$H:$H,MATCH(ROW()-2,Arkusz1!$C:$C,0)+5))","v":""},{"$f":"IF(ISERROR(MATCH(ROW()-2,Arkusz1!$C:$C,0)),\"\",INDEX('import danych'!$L:$L,MATCH(ROW()-2,Arkusz1!$C:$C,0)+5))","v":""}]
[{"$f":"IF(ISERROR(MATCH(ROW()-2,Arkusz1!$C:$C,0)),\"\",INDEX(Arkusz1!C:C,MATCH(ROW()-2,Arkusz1!$C:$C,0)))","v":""},{"$f":"IF(ISERROR(MATCH(ROW()-2,Arkusz1!$C:$C,0)),\"\",INDEX('import danych'!$A:$A,MATCH(ROW()-2,Arkusz1!$C:$C,0)+5))","v":""},"",{"$f":"IF(ISERROR(MATCH(ROW()-2,Arkusz1!$C:$C,0)),\"\",INDEX('import danych'!$B:$B,MATCH(ROW()-2,Arkusz1!$C:$C,0)+5))","v":""},{"$f":"IF(ISERROR(MATCH(ROW()-2,Arkusz1!$C:$C,0)),\"\",INDEX(Arkusz1!I:I,MATCH(ROW()-2,Arkusz1!$C:$C,0)))","v":""},{"$f":"IF(ISERROR(MATCH(ROW()-2,Arkusz1!$C:$C,0)),\"\",INDEX('import danych'!$H:$H,MATCH(ROW()-2,Arkusz1!$C:$C,0)+5))","v":""},{"$f":"IF(ISERROR(MATCH(ROW()-2,Arkusz1!$C:$C,0)),\"\",INDEX('import danych'!$L:$L,MATCH(ROW()-2,Arkusz1!$C:$C,0)+5))","v":""}]
[{"$f":"IF(ISERROR(MATCH(ROW()-2,Arkusz1!$C:$C,0)),\"\",INDEX(Arkusz1!C:C,MATCH(ROW()-2,Arkusz1!$C:$C,0)))","v":""},{"$f":"IF(ISERROR(MATCH(ROW()-2,Arkusz1!$C:$C,0)),\"\",INDEX('import danych'!$A:$A,MATCH(ROW()-2,Arkusz1!$C:$C,0)+5))","v":""},"",{"$f":"IF(ISERROR(MATCH(ROW()-2,Arkusz1!$C:$C,0)),\"\",INDEX('import danych'!$B:$B,MATCH(ROW()-2,Arkusz1!$C:$C,0)+5))","v":""},{"$f":"IF(ISERROR(MATCH(ROW()-2,Arkusz1!$C:$C,0)),\"\",INDEX(Arkusz1!I:I,MATCH(ROW()-2,Arkusz1!$C:$C,0)))","v":""},{"$f":"IF(ISERROR(MATCH(ROW()-2,Arkusz1!$C:$C,0)),\"\",INDEX('import danych'!$H:$H,MATCH(ROW()-2,Arkusz1!$C:$C,0)+5))","v":""},{"$f":"IF(ISERROR(MATCH(ROW()-2,Arkusz1!$C:$C,0)),\"\",INDEX('import danych'!$L:$L,MATCH(ROW()-2,Arkusz1!$C:$C,0)+5))","v":""}]
[{"$f":"IF(ISERROR(MATCH(ROW()-2,Arkusz1!$C:$C,0)),\"\",INDEX(Arkusz1!C:C,MATCH(ROW()-2,Arkusz1!$C:$C,0)))","v":""},{"$f":"IF(ISERROR(MATCH(ROW()-2,Arkusz1!$C:$C,0)),\"\",INDEX('import danych'!$A:$A,MATCH(ROW()-2,Arkusz1!$C:$C,0)+5))","v":""},"",{"$f":"IF(ISERROR(MATCH(ROW()-2,Arkusz1!$C:$C,0)),\"\",INDEX('import danych'!$B:$B,MATCH(ROW()-2,Arkusz1!$C:$C,0)+5))","v":""},{"$f":"IF(ISERROR(MATCH(ROW()-2,Arkusz1!$C:$C,0)),\"\",INDEX(Arkusz1!I:I,MATCH(ROW()-2,Arkusz1!$C:$C,0)))","v":""},{"$f":"IF(ISERROR(MATCH(ROW()-2,Arkusz1!$C:$C,0)),\"\",INDEX('import danych'!$H:$H,MATCH(ROW()-2,Arkusz1!$C:$C,0)+5))","v":""},{"$f":"IF(ISERROR(MATCH(ROW()-2,Arkusz1!$C:$C,0)),\"\",INDEX('import danych'!$L:$L,MATCH(ROW()-2,Arkusz1!$C:$C,0)+5))","v":""}]
[{"$f":"IF(ISERROR(MATCH(ROW()-2,Arkusz1!$C:$C,0)),\"\",INDEX(Arkusz1!C:C,MATCH(ROW()-2,Arkusz1!$C:$C,0)))","v":""},{"$f":"IF(ISERROR(MATCH(ROW()-2,Arkusz1!$C:$C,0)),\"\",INDEX('import danych'!$A:$A,MATCH(ROW()-2,Arkusz1!$C:$C,0)+5))","v":""},"",{"$f":"IF(ISERROR(MATCH(ROW()-2,Arkusz1!$C:$C,0)),\"\",INDEX('import danych'!$B:$B,MATCH(ROW()-2,Arkusz1!$C:$C,0)+5))","v":""},{"$f":"IF(ISERROR(MATCH(ROW()-2,Arkusz1!$C:$C,0)),\"\",INDEX(Arkusz1!I:I,MATCH(ROW()-2,Arkusz1!$C:$C,0)))","v":""},{"$f":"IF(ISERROR(MATCH(ROW()-2,Arkusz1!$C:$C,0)),\"\",INDEX('import danych'!$H:$H,MATCH(ROW()-2,Arkusz1!$C:$C,0)+5))","v":""},{"$f":"IF(ISERROR(MATCH(ROW()-2,Arkusz1!$C:$C,0)),\"\",INDEX('import danych'!$L:$L,MATCH(ROW()-2,Arkusz1!$C:$C,0)+5))","v":""}]
[{"$f":"IF(ISERROR(MATCH(ROW()-2,Arkusz1!$C:$C,0)),\"\",INDEX(Arkusz1!C:C,MATCH(ROW()-2,Arkusz1!$C:$C,0)))","v":""},{"$f":"IF(ISERROR(MATCH(ROW()-2,Arkusz1!$C:$C,0)),\"\",INDEX('import danych'!$A:$A,MATCH(ROW()-2,Arkusz1!$C:$C,0)+5))","v":""},"",{"$f":"IF(ISERROR(MATCH(ROW()-2,Arkusz1!$C:$C,0)),\"\",INDEX('import danych'!$B:$B,MATCH(ROW()-2,Arkusz1!$C:$C,0)+5))","v":""},{"$f":"IF(ISERROR(MATCH(ROW()-2,Arkusz1!$C:$C,0)),\"\",INDEX(Arkusz1!I:I,MATCH(ROW()-2,Arkusz1!$C:$C,0)))","v":""},{"$f":"IF(ISERROR(MATCH(ROW()-2,Arkusz1!$C:$C,0)),\"\",INDEX('import danych'!$H:$H,MATCH(ROW()-2,Arkusz1!$C:$C,0)+5))","v":""},{"$f":"IF(ISERROR(MATCH(ROW()-2,Arkusz1!$C:$C,0)),\"\",INDEX('import danych'!$L:$L,MATCH(ROW()-2,Arkusz1!$C:$C,0)+5))","v":""}]
[{"$f":"IF(ISERROR(MATCH(ROW()-2,Arkusz1!$C:$C,0)),\"\",INDEX(Arkusz1!C:C,MATCH(ROW()-2,Arkusz1!$C:$C,0)))","v":""},{"$f":"IF(ISERROR(MATCH(ROW()-2,Arkusz1!$C:$C,0)),\"\",INDEX('import danych'!$A:$A,MATCH(ROW()-2,Arkusz1!$C:$C,0)+5))","v":""},"",{"$f":"IF(ISERROR(MATCH(ROW()-2,Arkusz1!$C:$C,0)),\"\",INDEX('import danych'!$B:$B,MATCH(ROW()-2,Arkusz1!$C:$C,0)+5))","v":""},{"$f":"IF(ISERROR(MATCH(ROW()-2,Arkusz1!$C:$C,0)),\"\",INDEX(Arkusz1!I:I,MATCH(ROW()-2,Arkusz1!$C:$C,0)))","v":""},{"$f":"IF(ISERROR(MATCH(ROW()-2,Arkusz1!$C:$C,0)),\"\",INDEX('import danych'!$H:$H,MATCH(ROW()-2,Arkusz1!$C:$C,0)+5))","v":""},{"$f":"IF(ISERROR(MATCH(ROW()-2,Arkusz1!$C:$C,0)),\"\",INDEX('import danych'!$L:$L,MATCH(ROW()-2,Arkusz1!$C:$C,0)+5))","v":""}]
[{"$f":"IF(ISERROR(MATCH(ROW()-2,Arkusz1!$C:$C,0)),\"\",INDEX(Arkusz1!C:C,MATCH(ROW()-2,Arkusz1!$C:$C,0)))","v":""},{"$f":"IF(ISERROR(MATCH(ROW()-2,Arkusz1!$C:$C,0)),\"\",INDEX('import danych'!$A:$A,MATCH(ROW()-2,Arkusz1!$C:$C,0)+5))","v":""},"",{"$f":"IF(ISERROR(MATCH(ROW()-2,Arkusz1!$C:$C,0)),\"\",INDEX('import danych'!$B:$B,MATCH(ROW()-2,Arkusz1!$C:$C,0)+5))","v":""},{"$f":"IF(ISERROR(MATCH(ROW()-2,Arkusz1!$C:$C,0)),\"\",INDEX(Arkusz1!I:I,MATCH(ROW()-2,Arkusz1!$C:$C,0)))","v":""},{"$f":"IF(ISERROR(MATCH(ROW()-2,Arkusz1!$C:$C,0)),\"\",INDEX('import danych'!$H:$H,MATCH(ROW()-2,Arkusz1!$C:$C,0)+5))","v":""},{"$f":"IF(ISERROR(MATCH(ROW()-2,Arkusz1!$C:$C,0)),\"\",INDEX('import danych'!$L:$L,MATCH(ROW()-2,Arkusz1!$C:$C,0)+5))","v":""}]
[{"$f":"IF(ISERROR(MATCH(ROW()-2,Arkusz1!$C:$C,0)),\"\",INDEX(Arkusz1!C:C,MATCH(ROW()-2,Arkusz1!$C:$C,0)))","v":""},{"$f":"IF(ISERROR(MATCH(ROW()-2,Arkusz1!$C:$C,0)),\"\",INDEX('import danych'!$A:$A,MATCH(ROW()-2,Arkusz1!$C:$C,0)+5))","v":""},null,{"$f":"IF(ISERROR(MATCH(ROW()-2,Arkusz1!$C:$C,0)),\"\",INDEX('import danych'!$B:$B,MATCH(ROW()-2,Arkusz1!$C:$C,0)+5))","v":""},{"$f":"IF(ISERROR(MATCH(ROW()-2,Arkusz1!$C:$C,0)),\"\",INDEX(Arkusz1!I:I,MATCH(ROW()-2,Arkusz1!$C:$C,0)))","v":""},{"$f":"IF(ISERROR(MATCH(ROW()-2,Arkusz1!$C:$C,0)),\"\",INDEX('import danych'!$H:$H,MATCH(ROW()-2,Arkusz1!$C:$C,0)+5))","v":""},{"$f":"IF(ISERROR(MATCH(ROW()-2,Arkusz1!$C:$C,0)),\"\",INDEX('import danych'!$L:$L,MATCH(ROW()-2,Arkusz1!$C:$C,0)+5))","v":""}]
[{"$f":"IF(ISERROR(MATCH(ROW()-2,Arkusz1!$C:$C,0)),\"\",INDEX(Arkusz1!C:C,MATCH(ROW()-2,Arkusz1!$C:$C,0)))","v":""},{"$f":"IF(ISERROR(MATCH(ROW()-2,Arkusz1!$C:$C,0)),\"\",INDEX('import danych'!$A:$A,MATCH(ROW()-2,Arkusz1!$C:$C,0)+5))","v":""},null,{"$f":"IF(ISERROR(MATCH(ROW()-2,Arkusz1!$C:$C,0)),\"\",INDEX('import danych'!$B:$B,MATCH(ROW()-2,Arkusz1!$C:$C,0)+5))","v":""},{"$f":"IF(ISERROR(MATCH(ROW()-2,Arkusz1!$C:$C,0)),\"\",INDEX(Arkusz1!I:I,MATCH(ROW()-2,Arkusz1!$C:$C,0)))","v":""},{"$f":"IF(ISERROR(MATCH(ROW()-2,Arkusz1!$C:$C,0)),\"\",INDEX('import danych'!$H:$H,MATCH(ROW()-2,Arkusz1!$C:$C,0)+5))","v":""},{"$f":"IF(ISERROR(MATCH(ROW()-2,Arkusz1!$C:$C,0)),\"\",INDEX('import danych'!$L:$L,MATCH(ROW()-2,Arkusz1!$C:$C,0)+5))","v":""}]
[{"$f":"IF(ISERROR(MATCH(ROW()-2,Arkusz1!$C:$C,0)),\"\",INDEX(Arkusz1!C:C,MATCH(ROW()-2,Arkusz1!$C:$C,0)))","v":""},{"$f":"IF(ISERROR(MATCH(ROW()-2,Arkusz1!$C:$C,0)),\"\",INDEX('import danych'!$A:$A,MATCH(ROW()-2,Arkusz1!$C:$C,0)+5))","v":""},null,{"$f":"IF(ISERROR(MATCH(ROW()-2,Arkusz1!$C:$C,0)),\"\",INDEX('import danych'!$B:$B,MATCH(ROW()-2,Arkusz1!$C:$C,0)+5))","v":""},{"$f":"IF(ISERROR(MATCH(ROW()-2,Arkusz1!$C:$C,0)),\"\",INDEX(Arkusz1!I:I,MATCH(ROW()-2,Arkusz1!$C:$C,0)))","v":""},{"$f":"IF(ISERROR(MATCH(ROW()-2,Arkusz1!$C:$C,0)),\"\",INDEX('import danych'!$H:$H,MATCH(ROW()-2,Arkusz1!$C:$C,0)+5))","v":""},{"$f":"IF(ISERROR(MATCH(ROW()-2,Arkusz1!$C:$C,0)),\"\",INDEX('import danych'!$L:$L,MATCH(ROW()-2,Arkusz1!$C:$C,0)+5))","v":""}]
[{"$f":"IF(ISERROR(MATCH(ROW()-2,Arkusz1!$C:$C,0)),\"\",INDEX(Arkusz1!C:C,MATCH(ROW()-2,Arkusz1!$C:$C,0)))","v":""},{"$f":"IF(ISERROR(MATCH(ROW()-2,Arkusz1!$C:$C,0)),\"\",INDEX('import danych'!$A:$A,MATCH(ROW()-2,Arkusz1!$C:$C,0)+5))","v":""},null,{"$f":"IF(ISERROR(MATCH(ROW()-2,Arkusz1!$C:$C,0)),\"\",INDEX('import danych'!$B:$B,MATCH(ROW()-2,Arkusz1!$C:$C,0)+5))","v":""},{"$f":"IF(ISERROR(MATCH(ROW()-2,Arkusz1!$C:$C,0)),\"\",INDEX(Arkusz1!I:I,MATCH(ROW()-2,Arkusz1!$C:$C,0)))","v":""},{"$f":"IF(ISERROR(MATCH(ROW()-2,Arkusz1!$C:$C,0)),\"\",INDEX('import danych'!$H:$H,MATCH(ROW()-2,Arkusz1!$C:$C,0)+5))","v":""},{"$f":"IF(ISERROR(MATCH(ROW()-2,Arkusz1!$C:$C,0)),\"\",INDEX('import danych'!$L:$L,MATCH(ROW()-2,Arkusz1!$C:$C,0)+5))","v":""}]
[{"$f":"IF(ISERROR(MATCH(ROW()-2,Arkusz1!$C:$C,0)),\"\",INDEX(Arkusz1!C:C,MATCH(ROW()-2,Arkusz1!$C:$C,0)))","v":""},{"$f":"IF(ISERROR(MATCH(ROW()-2,Arkusz1!$C:$C,0)),\"\",INDEX('import danych'!$A:$A,MATCH(ROW()-2,Arkusz1!$C:$C,0)+5))","v":""},null,{"$f":"IF(ISERROR(MATCH(ROW()-2,Arkusz1!$C:$C,0)),\"\",INDEX('import danych'!$B:$B,MATCH(ROW()-2,Arkusz1!$C:$C,0)+5))","v":""},{"$f":"IF(ISERROR(MATCH(ROW()-2,Arkusz1!$C:$C,0)),\"\",INDEX(Arkusz1!I:I,MATCH(ROW()-2,Arkusz1!$C:$C,0)))","v":""},{"$f":"IF(ISERROR(MATCH(ROW()-2,Arkusz1!$C:$C,0)),\"\",INDEX('import danych'!$H:$H,MATCH(ROW()-2,Arkusz1!$C:$C,0)+5))","v":""},{"$f":"IF(ISERROR(MATCH(ROW()-2,Arkusz1!$C:$C,0)),\"\",INDEX('import danych'!$L:$L,MATCH(ROW()-2,Arkusz1!$C:$C,0)+5))","v":""}]
[{"$f":"IF(ISERROR(MATCH(ROW()-2,Arkusz1!$C:$C,0)),\"\",INDEX(Arkusz1!C:C,MATCH(ROW()-2,Arkusz1!$C:$C,0)))","v":""},{"$f":"IF(ISERROR(MATCH(ROW()-2,Arkusz1!$C:$C,0)),\"\",INDEX('import danych'!$A:$A,MATCH(ROW()-2,Arkusz1!$C:$C,0)+5))","v":""},null,{"$f":"IF(ISERROR(MATCH(ROW()-2,Arkusz1!$C:$C,0)),\"\",INDEX('import danych'!$B:$B,MATCH(ROW()-2,Arkusz1!$C:$C,0)+5))","v":""},{"$f":"IF(ISERROR(MATCH(ROW()-2,Arkusz1!$C:$C,0)),\"\",INDEX(Arkusz1!I:I,MATCH(ROW()-2,Arkusz1!$C:$C,0)))","v":""},{"$f":"IF(ISERROR(MATCH(ROW()-2,Arkusz1!$C:$C,0)),\"\",INDEX('import danych'!$H:$H,MATCH(ROW()-2,Arkusz1!$C:$C,0)+5))","v":""},{"$f":"IF(ISERROR(MATCH(ROW()-2,Arkusz1!$C:$C,0)),\"\",INDEX('import danych'!$L:$L,MATCH(ROW()-2,Arkusz1!$C:$C,0)+5))","v":""}]
[{"$f":"IF(ISERROR(MATCH(ROW()-2,Arkusz1!$C:$C,0)),\"\",INDEX(Arkusz1!C:C,MATCH(ROW()-2,Arkusz1!$C:$C,0)))","v":""},{"$f":"IF(ISERROR(MATCH(ROW()-2,Arkusz1!$C:$C,0)),\"\",INDEX('import danych'!$A:$A,MATCH(ROW()-2,Arkusz1!$C:$C,0)+5))","v":""},null,{"$f":"IF(ISERROR(MATCH(ROW()-2,Arkusz1!$C:$C,0)),\"\",INDEX('import danych'!$B:$B,MATCH(ROW()-2,Arkusz1!$C:$C,0)+5))","v":""},{"$f":"IF(ISERROR(MATCH(ROW()-2,Arkusz1!$C:$C,0)),\"\",INDEX(Arkusz1!I:I,MATCH(ROW()-2,Arkusz1!$C:$C,0)))","v":""},{"$f":"IF(ISERROR(MATCH(ROW()-2,Arkusz1!$C:$C,0)),\"\",INDEX('import danych'!$H:$H,MATCH(ROW()-2,Arkusz1!$C:$C,0)+5))","v":""},{"$f":"IF(ISERROR(MATCH(ROW()-2,Arkusz1!$C:$C,0)),\"\",INDEX('import danych'!$L:$L,MATCH(ROW()-2,Arkusz1!$C:$C,0)+5))","v":""}]
[{"$f":"IF(ISERROR(MATCH(ROW()-2,Arkusz1!$C:$C,0)),\"\",INDEX(Arkusz1!C:C,MATCH(ROW()-2,Arkusz1!$C:$C,0)))","v":""},{"$f":"IF(ISERROR(MATCH(ROW()-2,Arkusz1!$C:$C,0)),\"\",INDEX('import danych'!$A:$A,MATCH(ROW()-2,Arkusz1!$C:$C,0)+5))","v":""},null,{"$f":"IF(ISERROR(MATCH(ROW()-2,Arkusz1!$C:$C,0)),\"\",INDEX('import danych'!$B:$B,MATCH(ROW()-2,Arkusz1!$C:$C,0)+5))","v":""},{"$f":"IF(ISERROR(MATCH(ROW()-2,Arkusz1!$C:$C,0)),\"\",INDEX(Arkusz1!I:I,MATCH(ROW()-2,Arkusz1!$C:$C,0)))","v":""},{"$f":"IF(ISERROR(MATCH(ROW()-2,Arkusz1!$C:$C,0)),\"\",INDEX('import danych'!$H:$H,MATCH(ROW()-2,Arkusz1!$C:$C,0)+5))","v":""},{"$f":"IF(ISERROR(MATCH(ROW()-2,Arkusz1!$C:$C,0)),\"\",INDEX('import danych'!$L:$L,MATCH(ROW()-2,Arkusz1!$C:$C,0)+5))","v":""}]
[{"$f":"IF(ISERROR(MATCH(ROW()-2,Arkusz1!$C:$C,0)),\"\",INDEX(Arkusz1!C:C,MATCH(ROW()-2,Arkusz1!$C:$C,0)))","v":""},{"$f":"IF(ISERROR(MATCH(ROW()-2,Arkusz1!$C:$C,0)),\"\",INDEX('import danych'!$A:$A,MATCH(ROW()-2,Arkusz1!$C:$C,0)+5))","v":""},null,{"$f":"IF(ISERROR(MATCH(ROW()-2,Arkusz1!$C:$C,0)),\"\",INDEX('import danych'!$B:$B,MATCH(ROW()-2,Arkusz1!$C:$C,0)+5))","v":""},{"$f":"IF(ISERROR(MATCH(ROW()-2,Arkusz1!$C:$C,0)),\"\",INDEX(Arkusz1!I:I,MATCH(ROW()-2,Arkusz1!$C:$C,0)))","v":""},{"$f":"IF(ISERROR(MATCH(ROW()-2,Arkusz1!$C:$C,0)),\"\",INDEX('import danych'!$H:$H,MATCH(ROW()-2,Arkusz1!$C:$C,0)+5))","v":""},{"$f":"IF(ISERROR(MATCH(ROW()-2,Arkusz1!$C:$C,0)),\"\",INDEX('import danych'!$L:$L,MATCH(ROW()-2,Arkusz1!$C:$C,0)+5))","v":""}]
[{"$f":"IF(ISERROR(MATCH(ROW()-2,Arkusz1!$C:$C,0)),\"\",INDEX(Arkusz1!C:C,MATCH(ROW()-2,Arkusz1!$C:$C,0)))","v":""},{"$f":"IF(ISERROR(MATCH(ROW()-2,Arkusz1!$C:$C,0)),\"\",INDEX('import danych'!$A:$A,MATCH(ROW()-2,Arkusz1!$C:$C,0)+5))","v":""},null,{"$f":"IF(ISERROR(MATCH(ROW()-2,Arkusz1!$C:$C,0)),\"\",INDEX('import danych'!$B:$B,MATCH(ROW()-2,Arkusz1!$C:$C,0)+5))","v":""},{"$f":"IF(ISERROR(MATCH(ROW()-2,Arkusz1!$C:$C,0)),\"\",INDEX(Arkusz1!I:I,MATCH(ROW()-2,Arkusz1!$C:$C,0)))","v":""},{"$f":"IF(ISERROR(MATCH(ROW()-2,Arkusz1!$C:$C,0)),\"\",INDEX('import danych'!$H:$H,MATCH(ROW()-2,Arkusz1!$C:$C,0)+5))","v":""},{"$f":"IF(ISERROR(MATCH(ROW()-2,Arkusz1!$C:$C,0)),\"\",INDEX('import danych'!$L:$L,MATCH(ROW()-2,Arkusz1!$C:$C,0)+5))","v":""}]
[{"$f":"IF(ISERROR(MATCH(ROW()-2,Arkusz1!$C:$C,0)),\"\",INDEX(Arkusz1!C:C,MATCH(ROW()-2,Arkusz1!$C:$C,0)))","v":""},{"$f":"IF(ISERROR(MATCH(ROW()-2,Arkusz1!$C:$C,0)),\"\",INDEX('import danych'!$A:$A,MATCH(ROW()-2,Arkusz1!$C:$C,0)+5))","v":""},null,{"$f":"IF(ISERROR(MATCH(ROW()-2,Arkusz1!$C:$C,0)),\"\",INDEX('import danych'!$B:$B,MATCH(ROW()-2,Arkusz1!$C:$C,0)+5))","v":""},{"$f":"IF(ISERROR(MATCH(ROW()-2,Arkusz1!$C:$C,0)),\"\",INDEX(Arkusz1!I:I,MATCH(ROW()-2,Arkusz1!$C:$C,0)))","v":""},{"$f":"IF(ISERROR(MATCH(ROW()-2,Arkusz1!$C:$C,0)),\"\",INDEX('import danych'!$H:$H,MATCH(ROW()-2,Arkusz1!$C:$C,0)+5))","v":""},{"$f":"IF(ISERROR(MATCH(ROW()-2,Arkusz1!$C:$C,0)),\"\",INDEX('import danych'!$L:$L,MATCH(ROW()-2,Arkusz1!$C:$C,0)+5))","v":""}]
[{"$f":"IF(ISERROR(MATCH(ROW()-2,Arkusz1!$C:$C,0)),\"\",INDEX(Arkusz1!C:C,MATCH(ROW()-2,Arkusz1!$C:$C,0)))","v":""},{"$f":"IF(ISERROR(MATCH(ROW()-2,Arkusz1!$C:$C,0)),\"\",INDEX('import danych'!$A:$A,MATCH(ROW()-2,Arkusz1!$C:$C,0)+5))","v":""},null,{"$f":"IF(ISERROR(MATCH(ROW()-2,Arkusz1!$C:$C,0)),\"\",INDEX('import danych'!$B:$B,MATCH(ROW()-2,Arkusz1!$C:$C,0)+5))","v":""},{"$f":"IF(ISERROR(MATCH(ROW()-2,Arkusz1!$C:$C,0)),\"\",INDEX(Arkusz1!I:I,MATCH(ROW()-2,Arkusz1!$C:$C,0)))","v":""},{"$f":"IF(ISERROR(MATCH(ROW()-2,Arkusz1!$C:$C,0)),\"\",INDEX('import danych'!$H:$H,MATCH(ROW()-2,Arkusz1!$C:$C,0)+5))","v":""},{"$f":"IF(ISERROR(MATCH(ROW()-2,Arkusz1!$C:$C,0)),\"\",INDEX('import danych'!$L:$L,MATCH(ROW()-2,Arkusz1!$C:$C,0)+5))","v":""}]
[{"$f":"IF(ISERROR(MATCH(ROW()-2,Arkusz1!$C:$C,0)),\"\",INDEX(Arkusz1!C:C,MATCH(ROW()-2,Arkusz1!$C:$C,0)))","v":""},{"$f":"IF(ISERROR(MATCH(ROW()-2,Arkusz1!$C:$C,0)),\"\",INDEX('import danych'!$A:$A,MATCH(ROW()-2,Arkusz1!$C:$C,0)+5))","v":""},null,{"$f":"IF(ISERROR(MATCH(ROW()-2,Arkusz1!$C:$C,0)),\"\",INDEX('import danych'!$B:$B,MATCH(ROW()-2,Arkusz1!$C:$C,0)+5))","v":""},{"$f":"IF(ISERROR(MATCH(ROW()-2,Arkusz1!$C:$C,0)),\"\",INDEX(Arkusz1!I:I,MATCH(ROW()-2,Arkusz1!$C:$C,0)))","v":""},{"$f":"IF(ISERROR(MATCH(ROW()-2,Arkusz1!$C:$C,0)),\"\",INDEX('import danych'!$H:$H,MATCH(ROW()-2,Arkusz1!$C:$C,0)+5))","v":""},{"$f":"IF(ISERROR(MATCH(ROW()-2,Arkusz1!$C:$C,0)),\"\",INDEX('import danych'!$L:$L,MATCH(ROW()-2,Arkusz1!$C:$C,0)+5))","v":""}]
[{"$f":"IF(ISERROR(MATCH(ROW()-2,Arkusz1!$C:$C,0)),\"\",INDEX(Arkusz1!C:C,MATCH(ROW()-2,Arkusz1!$C:$C,0)))","v":""},{"$f":"IF(ISERROR(MATCH(ROW()-2,Arkusz1!$C:$C,0)),\"\",INDEX('import danych'!$A:$A,MATCH(ROW()-2,Arkusz1!$C:$C,0)+5))","v":""},null,{"$f":"IF(ISERROR(MATCH(ROW()-2,Arkusz1!$C:$C,0)),\"\",INDEX('import danych'!$B:$B,MATCH(ROW()-2,Arkusz1!$C:$C,0)+5))","v":""},{"$f":"IF(ISERROR(MATCH(ROW()-2,Arkusz1!$C:$C,0)),\"\",INDEX(Arkusz1!I:I,MATCH(ROW()-2,Arkusz1!$C:$C,0)))","v":""},{"$f":"IF(ISERROR(MATCH(ROW()-2,Arkusz1!$C:$C,0)),\"\",INDEX('import danych'!$H:$H,MATCH(ROW()-2,Arkusz1!$C:$C,0)+5))","v":""},{"$f":"IF(ISERROR(MATCH(ROW()-2,Arkusz1!$C:$C,0)),\"\",INDEX('import danych'!$L:$L,MATCH(ROW()-2,Arkusz1!$C:$C,0)+5))","v":""}]
[{"$f":"IF(ISERROR(MATCH(ROW()-2,Arkusz1!$C:$C,0)),\"\",INDEX(Arkusz1!C:C,MATCH(ROW()-2,Arkusz1!$C:$C,0)))","v":""},{"$f":"IF(ISERROR(MATCH(ROW()-2,Arkusz1!$C:$C,0)),\"\",INDEX('import danych'!$A:$A,MATCH(ROW()-2,Arkusz1!$C:$C,0)+5))","v":""},null,{"$f":"IF(ISERROR(MATCH(ROW()-2,Arkusz1!$C:$C,0)),\"\",INDEX('import danych'!$B:$B,MATCH(ROW()-2,Arkusz1!$C:$C,0)+5))","v":""},{"$f":"IF(ISERROR(MATCH(ROW()-2,Arkusz1!$C:$C,0)),\"\",INDEX(Arkusz1!I:I,MATCH(ROW()-2,Arkusz1!$C:$C,0)))","v":""},{"$f":"IF(ISERROR(MATCH(ROW()-2,Arkusz1!$C:$C,0)),\"\",INDEX('import danych'!$H:$H,MATCH(ROW()-2,Arkusz1!$C:$C,0)+5))","v":""},{"$f":"IF(ISERROR(MATCH(ROW()-2,Arkusz1!$C:$C,0)),\"\",INDEX('import danych'!$L:$L,MATCH(ROW()-2,Arkusz1!$C:$C,0)+5))","v":""}]
[{"$f":"IF(ISERROR(MATCH(ROW()-2,Arkusz1!$C:$C,0)),\"\",INDEX(Arkusz1!C:C,MATCH(ROW()-2,Arkusz1!$C:$C,0)))","v":""},{"$f":"IF(ISERROR(MATCH(ROW()-2,Arkusz1!$C:$C,0)),\"\",INDEX('import danych'!$A:$A,MATCH(ROW()-2,Arkusz1!$C:$C,0)+5))","v":""},null,{"$f":"IF(ISERROR(MATCH(ROW()-2,Arkusz1!$C:$C,0)),\"\",INDEX('import danych'!$B:$B,MATCH(ROW()-2,Arkusz1!$C:$C,0)+5))","v":""},{"$f":"IF(ISERROR(MATCH(ROW()-2,Arkusz1!$C:$C,0)),\"\",INDEX(Arkusz1!I:I,MATCH(ROW()-2,Arkusz1!$C:$C,0)))","v":""},{"$f":"IF(ISERROR(MATCH(ROW()-2,Arkusz1!$C:$C,0)),\"\",INDEX('import danych'!$H:$H,MATCH(ROW()-2,Arkusz1!$C:$C,0)+5))","v":""},{"$f":"IF(ISERROR(MATCH(ROW()-2,Arkusz1!$C:$C,0)),\"\",INDEX('import danych'!$L:$L,MATCH(ROW()-2,Arkusz1!$C:$C,0)+5))","v":""}]
[{"$f":"IF(ISERROR(MATCH(ROW()-2,Arkusz1!$C:$C,0)),\"\",INDEX(Arkusz1!C:C,MATCH(ROW()-2,Arkusz1!$C:$C,0)))","v":""},{"$f":"IF(ISERROR(MATCH(ROW()-2,Arkusz1!$C:$C,0)),\"\",INDEX('import danych'!$A:$A,MATCH(ROW()-2,Arkusz1!$C:$C,0)+5))","v":""},null,{"$f":"IF(ISERROR(MATCH(ROW()-2,Arkusz1!$C:$C,0)),\"\",INDEX('import danych'!$B:$B,MATCH(ROW()-2,Arkusz1!$C:$C,0)+5))","v":""},{"$f":"IF(ISERROR(MATCH(ROW()-2,Arkusz1!$C:$C,0)),\"\",INDEX(Arkusz1!I:I,MATCH(ROW()-2,Arkusz1!$C:$C,0)))","v":""},{"$f":"IF(ISERROR(MATCH(ROW()-2,Arkusz1!$C:$C,0)),\"\",INDEX('import danych'!$H:$H,MATCH(ROW()-2,Arkusz1!$C:$C,0)+5))","v":""},{"$f":"IF(ISERROR(MATCH(ROW()-2,Arkusz1!$C:$C,0)),\"\",INDEX('import danych'!$L:$L,MATCH(ROW()-2,Arkusz1!$C:$C,0)+5))","v":""}]
[{"$f":"IF(ISERROR(MATCH(ROW()-2,Arkusz1!$C:$C,0)),\"\",INDEX(Arkusz1!C:C,MATCH(ROW()-2,Arkusz1!$C:$C,0)))","v":""},{"$f":"IF(ISERROR(MATCH(ROW()-2,Arkusz1!$C:$C,0)),\"\",INDEX('import danych'!$A:$A,MATCH(ROW()-2,Arkusz1!$C:$C,0)+5))","v":""},null,{"$f":"IF(ISERROR(MATCH(ROW()-2,Arkusz1!$C:$C,0)),\"\",INDEX('import danych'!$B:$B,MATCH(ROW()-2,Arkusz1!$C:$C,0)+5))","v":""},{"$f":"IF(ISERROR(MATCH(ROW()-2,Arkusz1!$C:$C,0)),\"\",INDEX(Arkusz1!I:I,MATCH(ROW()-2,Arkusz1!$C:$C,0)))","v":""},{"$f":"IF(ISERROR(MATCH(ROW()-2,Arkusz1!$C:$C,0)),\"\",INDEX('import danych'!$H:$H,MATCH(ROW()-2,Arkusz1!$C:$C,0)+5))","v":""},{"$f":"IF(ISERROR(MATCH(ROW()-2,Arkusz1!$C:$C,0)),\"\",INDEX('import danych'!$L:$L,MATCH(ROW()-2,Arkusz1!$C:$C,0)+5))","v":""}]
[{"$f":"IF(ISERROR(MATCH(ROW()-2,Arkusz1!$C:$C,0)),\"\",INDEX(Arkusz1!C:C,MATCH(ROW()-2,Arkusz1!$C:$C,0)))","v":""},{"$f":"IF(ISERROR(MATCH(ROW()-2,Arkusz1!$C:$C,0)),\"\",INDEX('import danych'!$A:$A,MATCH(ROW()-2,Arkusz1!$C:$C,0)+5))","v":""},null,{"$f":"IF(ISERROR(MATCH(ROW()-2,Arkusz1!$C:$C,0)),\"\",INDEX('import danych'!$B:$B,MATCH(ROW()-2,Arkusz1!$C:$C,0)+5))","v":""},{"$f":"IF(ISERROR(MATCH(ROW()-2,Arkusz1!$C:$C,0)),\"\",INDEX(Arkusz1!I:I,MATCH(ROW()-2,Arkusz1!$C:$C,0)))","v":""},{"$f":"IF(ISERROR(MATCH(ROW()-2,Arkusz1!$C:$C,0)),\"\",INDEX('import danych'!$H:$H,MATCH(ROW()-2,Arkusz1!$C:$C,0)+5))","v":""},{"$f":"IF(ISERROR(MATCH(ROW()-2,Arkusz1!$C:$C,0)),\"\",INDEX('import danych'!$L:$L,MATCH(ROW()-2,Arkusz1!$C:$C,0)+5))","v":""}]
[{"$f":"IF(ISERROR(MATCH(ROW()-2,Arkusz1!$C:$C,0)),\"\",INDEX(Arkusz1!C:C,MATCH(ROW()-2,Arkusz1!$C:$C,0)))","v":""},{"$f":"IF(ISERROR(MATCH(ROW()-2,Arkusz1!$C:$C,0)),\"\",INDEX('import danych'!$A:$A,MATCH(ROW()-2,Arkusz1!$C:$C,0)+5))","v":""},null,{"$f":"IF(ISERROR(MATCH(ROW()-2,Arkusz1!$C:$C,0)),\"\",INDEX('import danych'!$B:$B,MATCH(ROW()-2,Arkusz1!$C:$C,0)+5))","v":""},{"$f":"IF(ISERROR(MATCH(ROW()-2,Arkusz1!$C:$C,0)),\"\",INDEX(Arkusz1!I:I,MATCH(ROW()-2,Arkusz1!$C:$C,0)))","v":""},{"$f":"IF(ISERROR(MATCH(ROW()-2,Arkusz1!$C:$C,0)),\"\",INDEX('import danych'!$H:$H,MATCH(ROW()-2,Arkusz1!$C:$C,0)+5))","v":""},{"$f":"IF(ISERROR(MATCH(ROW()-2,Arkusz1!$C:$C,0)),\"\",INDEX('import danych'!$L:$L,MATCH(ROW()-2,Arkusz1!$C:$C,0)+5))","v":""}]
[{"$f":"IF(ISERROR(MATCH(ROW()-2,Arkusz1!$C:$C,0)),\"\",INDEX(Arkusz1!C:C,MATCH(ROW()-2,Arkusz1!$C:$C,0)))","v":""},{"$f":"IF(ISERROR(MATCH(ROW()-2,Arkusz1!$C:$C,0)),\"\",INDEX('import danych'!$A:$A,MATCH(ROW()-2,Arkusz1!$C:$C,0)+5))","v":""},null,{"$f":"IF(ISERROR(MATCH(ROW()-2,Arkusz1!$C:$C,0)),\"\",INDEX('import danych'!$B:$B,MATCH(ROW()-2,Arkusz1!$C:$C,0)+5))","v":""},{"$f":"IF(ISERROR(MATCH(ROW()-2,Arkusz1!$C:$C,0)),\"\",INDEX(Arkusz1!I:I,MATCH(ROW()-2,Arkusz1!$C:$C,0)))","v":""},{"$f":"IF(ISERROR(MATCH(ROW()-2,Arkusz1!$C:$C,0)),\"\",INDEX('import danych'!$H:$H,MATCH(ROW()-2,Arkusz1!$C:$C,0)+5))","v":""},{"$f":"IF(ISERROR(MATCH(ROW()-2,Arkusz1!$C:$C,0)),\"\",INDEX('import danych'!$L:$L,MATCH(ROW()-2,Arkusz1!$C:$C,0)+5))","v":""}]
[{"$f":"IF(ISERROR(MATCH(ROW()-2,Arkusz1!$C:$C,0)),\"\",INDEX(Arkusz1!C:C,MATCH(ROW()-2,Arkusz1!$C:$C,0)))","v":""},{"$f":"IF(ISERROR(MATCH(ROW()-2,Arkusz1!$C:$C,0)),\"\",INDEX('import danych'!$A:$A,MATCH(ROW()-2,Arkusz1!$C:$C,0)+5))","v":""},null,{"$f":"IF(ISERROR(MATCH(ROW()-2,Arkusz1!$C:$C,0)),\"\",INDEX('import danych'!$B:$B,MATCH(ROW()-2,Arkusz1!$C:$C,0)+5))","v":""},{"$f":"IF(ISERROR(MATCH(ROW()-2,Arkusz1!$C:$C,0)),\"\",INDEX(Arkusz1!I:I,MATCH(ROW()-2,Arkusz1!$C:$C,0)))","v":""},{"$f":"IF(ISERROR(MATCH(ROW()-2,Arkusz1!$C:$C,0)),\"\",INDEX('import danych'!$H:$H,MATCH(ROW()-2,Arkusz1!$C:$C,0)+5))","v":""},{"$f":"IF(ISERROR(MATCH(ROW()-2,Arkusz1!$C:$C,0)),\"\",INDEX('import danych'!$L:$L,MATCH(ROW()-2,Arkusz1!$C:$C,0)+5))","v":""}]
[{"$f":"IF(ISERROR(MATCH(ROW()-2,Arkusz1!$C:$C,0)),\"\",INDEX(Arkusz1!C:C,MATCH(ROW()-2,Arkusz1!$C:$C,0)))","v":""},{"$f":"IF(ISERROR(MATCH(ROW()-2,Arkusz1!$C:$C,0)),\"\",INDEX('import danych'!$A:$A,MATCH(ROW()-2,Arkusz1!$C:$C,0)+5))","v":""},null,{"$f":"IF(ISERROR(MATCH(ROW()-2,Arkusz1!$C:$C,0)),\"\",INDEX('import danych'!$B:$B,MATCH(ROW()-2,Arkusz1!$C:$C,0)+5))","v":""},{"$f":"IF(ISERROR(MATCH(ROW()-2,Arkusz1!$C:$C,0)),\"\",INDEX(Arkusz1!I:I,MATCH(ROW()-2,Arkusz1!$C:$C,0)))","v":""},{"$f":"IF(ISERROR(MATCH(ROW()-2,Arkusz1!$C:$C,0)),\"\",INDEX('import danych'!$H:$H,MATCH(ROW()-2,Arkusz1!$C:$C,0)+5))","v":""},{"$f":"IF(ISERROR(MATCH(ROW()-2,Arkusz1!$C:$C,0)),\"\",INDEX('import danych'!$L:$L,MATCH(ROW()-2,Arkusz1!$C:$C,0)+5))","v":""}]
[{"$f":"IF(ISERROR(MATCH(ROW()-2,Arkusz1!$C:$C,0)),\"\",INDEX(Arkusz1!C:C,MATCH(ROW()-2,Arkusz1!$C:$C,0)))","v":""},{"$f":"IF(ISERROR(MATCH(ROW()-2,Arkusz1!$C:$C,0)),\"\",INDEX('import danych'!$A:$A,MATCH(ROW()-2,Arkusz1!$C:$C,0)+5))","v":""},null,{"$f":"IF(ISERROR(MATCH(ROW()-2,Arkusz1!$C:$C,0)),\"\",INDEX('import danych'!$B:$B,MATCH(ROW()-2,Arkusz1!$C:$C,0)+5))","v":""},{"$f":"IF(ISERROR(MATCH(ROW()-2,Arkusz1!$C:$C,0)),\"\",INDEX(Arkusz1!I:I,MATCH(ROW()-2,Arkusz1!$C:$C,0)))","v":""},{"$f":"IF(ISERROR(MATCH(ROW()-2,Arkusz1!$C:$C,0)),\"\",INDEX('import danych'!$H:$H,MATCH(ROW()-2,Arkusz1!$C:$C,0)+5))","v":""},{"$f":"IF(ISERROR(MATCH(ROW()-2,Arkusz1!$C:$C,0)),\"\",INDEX('import danych'!$L:$L,MATCH(ROW()-2,Arkusz1!$C:$C,0)+5))","v":""}]
[{"$f":"IF(ISERROR(MATCH(ROW()-2,Arkusz1!$C:$C,0)),\"\",INDEX(Arkusz1!C:C,MATCH(ROW()-2,Arkusz1!$C:$C,0)))","v":""},{"$f":"IF(ISERROR(MATCH(ROW()-2,Arkusz1!$C:$C,0)),\"\",INDEX('import danych'!$A:$A,MATCH(ROW()-2,Arkusz1!$C:$C,0)+5))","v":""},null,{"$f":"IF(ISERROR(MATCH(ROW()-2,Arkusz1!$C:$C,0)),\"\",INDEX('import danych'!$B:$B,MATCH(ROW()-2,Arkusz1!$C:$C,0)+5))","v":""},{"$f":"IF(ISERROR(MATCH(ROW()-2,Arkusz1!$C:$C,0)),\"\",INDEX(Arkusz1!I:I,MATCH(ROW()-2,Arkusz1!$C:$C,0)))","v":""},{"$f":"IF(ISERROR(MATCH(ROW()-2,Arkusz1!$C:$C,0)),\"\",INDEX('import danych'!$H:$H,MATCH(ROW()-2,Arkusz1!$C:$C,0)+5))","v":""},{"$f":"IF(ISERROR(MATCH(ROW()-2,Arkusz1!$C:$C,0)),\"\",INDEX('import danych'!$L:$L,MATCH(ROW()-2,Arkusz1!$C:$C,0)+5))","v":""}]
[{"$f":"IF(ISERROR(MATCH(ROW()-2,Arkusz1!$C:$C,0)),\"\",INDEX(Arkusz1!C:C,MATCH(ROW()-2,Arkusz1!$C:$C,0)))","v":""},{"$f":"IF(ISERROR(MATCH(ROW()-2,Arkusz1!$C:$C,0)),\"\",INDEX('import danych'!$A:$A,MATCH(ROW()-2,Arkusz1!$C:$C,0)+5))","v":""},null,{"$f":"IF(ISERROR(MATCH(ROW()-2,Arkusz1!$C:$C,0)),\"\",INDEX('import danych'!$B:$B,MATCH(ROW()-2,Arkusz1!$C:$C,0)+5))","v":""},{"$f":"IF(ISERROR(MATCH(ROW()-2,Arkusz1!$C:$C,0)),\"\",INDEX(Arkusz1!I:I,MATCH(ROW()-2,Arkusz1!$C:$C,0)))","v":""},{"$f":"IF(ISERROR(MATCH(ROW()-2,Arkusz1!$C:$C,0)),\"\",INDEX('import danych'!$H:$H,MATCH(ROW()-2,Arkusz1!$C:$C,0)+5))","v":""},{"$f":"IF(ISERROR(MATCH(ROW()-2,Arkusz1!$C:$C,0)),\"\",INDEX('import danych'!$L:$L,MATCH(ROW()-2,Arkusz1!$C:$C,0)+5))","v":""}]
[{"$f":"IF(ISERROR(MATCH(ROW()-2,Arkusz1!$C:$C,0)),\"\",INDEX(Arkusz1!C:C,MATCH(ROW()-2,Arkusz1!$C:$C,0)))","v":""},{"$f":"IF(ISERROR(MATCH(ROW()-2,Arkusz1!$C:$C,0)),\"\",INDEX('import danych'!$A:$A,MATCH(ROW()-2,Arkusz1!$C:$C,0)+5))","v":""},null,{"$f":"IF(ISERROR(MATCH(ROW()-2,Arkusz1!$C:$C,0)),\"\",INDEX('import danych'!$B:$B,MATCH(ROW()-2,Arkusz1!$C:$C,0)+5))","v":""},{"$f":"IF(ISERROR(MATCH(ROW()-2,Arkusz1!$C:$C,0)),\"\",INDEX(Arkusz1!I:I,MATCH(ROW()-2,Arkusz1!$C:$C,0)))","v":""},{"$f":"IF(ISERROR(MATCH(ROW()-2,Arkusz1!$C:$C,0)),\"\",INDEX('import danych'!$H:$H,MATCH(ROW()-2,Arkusz1!$C:$C,0)+5))","v":""},{"$f":"IF(ISERROR(MATCH(ROW()-2,Arkusz1!$C:$C,0)),\"\",INDEX('import danych'!$L:$L,MATCH(ROW()-2,Arkusz1!$C:$C,0)+5))","v":""}]
[{"$f":"IF(ISERROR(MATCH(ROW()-2,Arkusz1!$C:$C,0)),\"\",INDEX(Arkusz1!C:C,MATCH(ROW()-2,Arkusz1!$C:$C,0)))","v":""},{"$f":"IF(ISERROR(MATCH(ROW()-2,Arkusz1!$C:$C,0)),\"\",INDEX('import danych'!$A:$A,MATCH(ROW()-2,Arkusz1!$C:$C,0)+5))","v":""},null,{"$f":"IF(ISERROR(MATCH(ROW()-2,Arkusz1!$C:$C,0)),\"\",INDEX('import danych'!$B:$B,MATCH(ROW()-2,Arkusz1!$C:$C,0)+5))","v":""},{"$f":"IF(ISERROR(MATCH(ROW()-2,Arkusz1!$C:$C,0)),\"\",INDEX(Arkusz1!I:I,MATCH(ROW()-2,Arkusz1!$C:$C,0)))","v":""},{"$f":"IF(ISERROR(MATCH(ROW()-2,Arkusz1!$C:$C,0)),\"\",INDEX('import danych'!$H:$H,MATCH(ROW()-2,Arkusz1!$C:$C,0)+5))","v":""},{"$f":"IF(ISERROR(MATCH(ROW()-2,Arkusz1!$C:$C,0)),\"\",INDEX('import danych'!$L:$L,MATCH(ROW()-2,Arkusz1!$C:$C,0)+5))","v":""}]
[{"$f":"IF(ISERROR(MATCH(ROW()-2,Arkusz1!$C:$C,0)),\"\",INDEX(Arkusz1!C:C,MATCH(ROW()-2,Arkusz1!$C:$C,0)))","v":""},{"$f":"IF(ISERROR(MATCH(ROW()-2,Arkusz1!$C:$C,0)),\"\",INDEX('import danych'!$A:$A,MATCH(ROW()-2,Arkusz1!$C:$C,0)+5))","v":""},null,{"$f":"IF(ISERROR(MATCH(ROW()-2,Arkusz1!$C:$C,0)),\"\",INDEX('import danych'!$B:$B,MATCH(ROW()-2,Arkusz1!$C:$C,0)+5))","v":""},{"$f":"IF(ISERROR(MATCH(ROW()-2,Arkusz1!$C:$C,0)),\"\",INDEX(Arkusz1!I:I,MATCH(ROW()-2,Arkusz1!$C:$C,0)))","v":""},{"$f":"IF(ISERROR(MATCH(ROW()-2,Arkusz1!$C:$C,0)),\"\",INDEX('import danych'!$H:$H,MATCH(ROW()-2,Arkusz1!$C:$C,0)+5))","v":""},{"$f":"IF(ISERROR(MATCH(ROW()-2,Arkusz1!$C:$C,0)),\"\",INDEX('import danych'!$L:$L,MATCH(ROW()-2,Arkusz1!$C:$C,0)+5))","v":""}]
[{"$f":"IF(ISERROR(MATCH(ROW()-2,Arkusz1!$C:$C,0)),\"\",INDEX(Arkusz1!C:C,MATCH(ROW()-2,Arkusz1!$C:$C,0)))","v":""},{"$f":"IF(ISERROR(MATCH(ROW()-2,Arkusz1!$C:$C,0)),\"\",INDEX('import danych'!$A:$A,MATCH(ROW()-2,Arkusz1!$C:$C,0)+5))","v":""},null,{"$f":"IF(ISERROR(MATCH(ROW()-2,Arkusz1!$C:$C,0)),\"\",INDEX('import danych'!$B:$B,MATCH(ROW()-2,Arkusz1!$C:$C,0)+5))","v":""},{"$f":"IF(ISERROR(MATCH(ROW()-2,Arkusz1!$C:$C,0)),\"\",INDEX(Arkusz1!I:I,MATCH(ROW()-2,Arkusz1!$C:$C,0)))","v":""},{"$f":"IF(ISERROR(MATCH(ROW()-2,Arkusz1!$C:$C,0)),\"\",INDEX('import danych'!$H:$H,MATCH(ROW()-2,Arkusz1!$C:$C,0)+5))","v":""},{"$f":"IF(ISERROR(MATCH(ROW()-2,Arkusz1!$C:$C,0)),\"\",INDEX('import danych'!$L:$L,MATCH(ROW()-2,Arkusz1!$C:$C,0)+5))","v":""}]
[{"$f":"IF(ISERROR(MATCH(ROW()-2,Arkusz1!$C:$C,0)),\"\",INDEX(Arkusz1!C:C,MATCH(ROW()-2,Arkusz1!$C:$C,0)))","v":""},{"$f":"IF(ISERROR(MATCH(ROW()-2,Arkusz1!$C:$C,0)),\"\",INDEX('import danych'!$A:$A,MATCH(ROW()-2,Arkusz1!$C:$C,0)+5))","v":""},null,{"$f":"IF(ISERROR(MATCH(ROW()-2,Arkusz1!$C:$C,0)),\"\",INDEX('import danych'!$B:$B,MATCH(ROW()-2,Arkusz1!$C:$C,0)+5))","v":""},{"$f":"IF(ISERROR(MATCH(ROW()-2,Arkusz1!$C:$C,0)),\"\",INDEX(Arkusz1!I:I,MATCH(ROW()-2,Arkusz1!$C:$C,0)))","v":""},{"$f":"IF(ISERROR(MATCH(ROW()-2,Arkusz1!$C:$C,0)),\"\",INDEX('import danych'!$H:$H,MATCH(ROW()-2,Arkusz1!$C:$C,0)+5))","v":""},{"$f":"IF(ISERROR(MATCH(ROW()-2,Arkusz1!$C:$C,0)),\"\",INDEX('import danych'!$L:$L,MATCH(ROW()-2,Arkusz1!$C:$C,0)+5))","v":""}]
[{"$f":"IF(ISERROR(MATCH(ROW()-2,Arkusz1!$C:$C,0)),\"\",INDEX(Arkusz1!C:C,MATCH(ROW()-2,Arkusz1!$C:$C,0)))","v":""},{"$f":"IF(ISERROR(MATCH(ROW()-2,Arkusz1!$C:$C,0)),\"\",INDEX('import danych'!$A:$A,MATCH(ROW()-2,Arkusz1!$C:$C,0)+5))","v":""},null,{"$f":"IF(ISERROR(MATCH(ROW()-2,Arkusz1!$C:$C,0)),\"\",INDEX('import danych'!$B:$B,MATCH(ROW()-2,Arkusz1!$C:$C,0)+5))","v":""},{"$f":"IF(ISERROR(MATCH(ROW()-2,Arkusz1!$C:$C,0)),\"\",INDEX(Arkusz1!I:I,MATCH(ROW()-2,Arkusz1!$C:$C,0)))","v":""},{"$f":"IF(ISERROR(MATCH(ROW()-2,Arkusz1!$C:$C,0)),\"\",INDEX('import danych'!$H:$H,MATCH(ROW()-2,Arkusz1!$C:$C,0)+5))","v":""},{"$f":"IF(ISERROR(MATCH(ROW()-2,Arkusz1!$C:$C,0)),\"\",INDEX('import danych'!$L:$L,MATCH(ROW()-2,Arkusz1!$C:$C,0)+5))","v":""}]
[{"$f":"IF(ISERROR(MATCH(ROW()-2,Arkusz1!$C:$C,0)),\"\",INDEX(Arkusz1!C:C,MATCH(ROW()-2,Arkusz1!$C:$C,0)))","v":""},{"$f":"IF(ISERROR(MATCH(ROW()-2,Arkusz1!$C:$C,0)),\"\",INDEX('import danych'!$A:$A,MATCH(ROW()-2,Arkusz1!$C:$C,0)+5))","v":""},null,{"$f":"IF(ISERROR(MATCH(ROW()-2,Arkusz1!$C:$C,0)),\"\",INDEX('import danych'!$B:$B,MATCH(ROW()-2,Arkusz1!$C:$C,0)+5))","v":""},{"$f":"IF(ISERROR(MATCH(ROW()-2,Arkusz1!$C:$C,0)),\"\",INDEX(Arkusz1!I:I,MATCH(ROW()-2,Arkusz1!$C:$C,0)))","v":""},{"$f":"IF(ISERROR(MATCH(ROW()-2,Arkusz1!$C:$C,0)),\"\",INDEX('import danych'!$H:$H,MATCH(ROW()-2,Arkusz1!$C:$C,0)+5))","v":""},{"$f":"IF(ISERROR(MATCH(ROW()-2,Arkusz1!$C:$C,0)),\"\",INDEX('import danych'!$L:$L,MATCH(ROW()-2,Arkusz1!$C:$C,0)+5))","v":""}]
[{"$f":"IF(ISERROR(MATCH(ROW()-2,Arkusz1!$C:$C,0)),\"\",INDEX(Arkusz1!C:C,MATCH(ROW()-2,Arkusz1!$C:$C,0)))","v":""},{"$f":"IF(ISERROR(MATCH(ROW()-2,Arkusz1!$C:$C,0)),\"\",INDEX('import danych'!$A:$A,MATCH(ROW()-2,Arkusz1!$C:$C,0)+5))","v":""},null,{"$f":"IF(ISERROR(MATCH(ROW()-2,Arkusz1!$C:$C,0)),\"\",INDEX('import danych'!$B:$B,MATCH(ROW()-2,Arkusz1!$C:$C,0)+5))","v":""},{"$f":"IF(ISERROR(MATCH(ROW()-2,Arkusz1!$C:$C,0)),\"\",INDEX(Arkusz1!I:I,MATCH(ROW()-2,Arkusz1!$C:$C,0)))","v":""},{"$f":"IF(ISERROR(MATCH(ROW()-2,Arkusz1!$C:$C,0)),\"\",INDEX('import danych'!$H:$H,MATCH(ROW()-2,Arkusz1!$C:$C,0)+5))","v":""},{"$f":"IF(ISERROR(MATCH(ROW()-2,Arkusz1!$C:$C,0)),\"\",INDEX('import danych'!$L:$L,MATCH(ROW()-2,Arkusz1!$C:$C,0)+5))","v":""}]
[{"$f":"IF(ISERROR(MATCH(ROW()-2,Arkusz1!$C:$C,0)),\"\",INDEX(Arkusz1!C:C,MATCH(ROW()-2,Arkusz1!$C:$C,0)))","v":""},{"$f":"IF(ISERROR(MATCH(ROW()-2,Arkusz1!$C:$C,0)),\"\",INDEX('import danych'!$A:$A,MATCH(ROW()-2,Arkusz1!$C:$C,0)+5))","v":""},null,{"$f":"IF(ISERROR(MATCH(ROW()-2,Arkusz1!$C:$C,0)),\"\",INDEX('import danych'!$B:$B,MATCH(ROW()-2,Arkusz1!$C:$C,0)+5))","v":""},{"$f":"IF(ISERROR(MATCH(ROW()-2,Arkusz1!$C:$C,0)),\"\",INDEX(Arkusz1!I:I,MATCH(ROW()-2,Arkusz1!$C:$C,0)))","v":""},{"$f":"IF(ISERROR(MATCH(ROW()-2,Arkusz1!$C:$C,0)),\"\",INDEX('import danych'!$H:$H,MATCH(ROW()-2,Arkusz1!$C:$C,0)+5))","v":""},{"$f":"IF(ISERROR(MATCH(ROW()-2,Arkusz1!$C:$C,0)),\"\",INDEX('import danych'!$L:$L,MATCH(ROW()-2,Arkusz1!$C:$C,0)+5))","v":""}]
[{"$f":"IF(ISERROR(MATCH(ROW()-2,Arkusz1!$C:$C,0)),\"\",INDEX(Arkusz1!C:C,MATCH(ROW()-2,Arkusz1!$C:$C,0)))","v":""},{"$f":"IF(ISERROR(MATCH(ROW()-2,Arkusz1!$C:$C,0)),\"\",INDEX('import danych'!$A:$A,MATCH(ROW()-2,Arkusz1!$C:$C,0)+5))","v":""},null,{"$f":"IF(ISERROR(MATCH(ROW()-2,Arkusz1!$C:$C,0)),\"\",INDEX('import danych'!$B:$B,MATCH(ROW()-2,Arkusz1!$C:$C,0)+5))","v":""},{"$f":"IF(ISERROR(MATCH(ROW()-2,Arkusz1!$C:$C,0)),\"\",INDEX(Arkusz1!I:I,MATCH(ROW()-2,Arkusz1!$C:$C,0)))","v":""},{"$f":"IF(ISERROR(MATCH(ROW()-2,Arkusz1!$C:$C,0)),\"\",INDEX('import danych'!$H:$H,MATCH(ROW()-2,Arkusz1!$C:$C,0)+5))","v":""},{"$f":"IF(ISERROR(MATCH(ROW()-2,Arkusz1!$C:$C,0)),\"\",INDEX('import danych'!$L:$L,MATCH(ROW()-2,Arkusz1!$C:$C,0)+5))","v":""}]
[{"$f":"IF(ISERROR(MATCH(ROW()-2,Arkusz1!$C:$C,0)),\"\",INDEX(Arkusz1!C:C,MATCH(ROW()-2,Arkusz1!$C:$C,0)))","v":""},{"$f":"IF(ISERROR(MATCH(ROW()-2,Arkusz1!$C:$C,0)),\"\",INDEX('import danych'!$A:$A,MATCH(ROW()-2,Arkusz1!$C:$C,0)+5))","v":""},null,{"$f":"IF(ISERROR(MATCH(ROW()-2,Arkusz1!$C:$C,0)),\"\",INDEX('import danych'!$B:$B,MATCH(ROW()-2,Arkusz1!$C:$C,0)+5))","v":""},{"$f":"IF(ISERROR(MATCH(ROW()-2,Arkusz1!$C:$C,0)),\"\",INDEX(Arkusz1!I:I,MATCH(ROW()-2,Arkusz1!$C:$C,0)))","v":""},{"$f":"IF(ISERROR(MATCH(ROW()-2,Arkusz1!$C:$C,0)),\"\",INDEX('import danych'!$H:$H,MATCH(ROW()-2,Arkusz1!$C:$C,0)+5))","v":""},{"$f":"IF(ISERROR(MATCH(ROW()-2,Arkusz1!$C:$C,0)),\"\",INDEX('import danych'!$L:$L,MATCH(ROW()-2,Arkusz1!$C:$C,0)+5))","v":""}]
[{"$f":"IF(ISERROR(MATCH(ROW()-2,Arkusz1!$C:$C,0)),\"\",INDEX(Arkusz1!C:C,MATCH(ROW()-2,Arkusz1!$C:$C,0)))","v":""},{"$f":"IF(ISERROR(MATCH(ROW()-2,Arkusz1!$C:$C,0)),\"\",INDEX('import danych'!$A:$A,MATCH(ROW()-2,Arkusz1!$C:$C,0)+5))","v":""},null,{"$f":"IF(ISERROR(MATCH(ROW()-2,Arkusz1!$C:$C,0)),\"\",INDEX('import danych'!$B:$B,MATCH(ROW()-2,Arkusz1!$C:$C,0)+5))","v":""},{"$f":"IF(ISERROR(MATCH(ROW()-2,Arkusz1!$C:$C,0)),\"\",INDEX(Arkusz1!I:I,MATCH(ROW()-2,Arkusz1!$C:$C,0)))","v":""},{"$f":"IF(ISERROR(MATCH(ROW()-2,Arkusz1!$C:$C,0)),\"\",INDEX('import danych'!$H:$H,MATCH(ROW()-2,Arkusz1!$C:$C,0)+5))","v":""},{"$f":"IF(ISERROR(MATCH(ROW()-2,Arkusz1!$C:$C,0)),\"\",INDEX('import danych'!$L:$L,MATCH(ROW()-2,Arkusz1!$C:$C,0)+5))","v":""}]
[{"$f":"IF(ISERROR(MATCH(ROW()-2,Arkusz1!$C:$C,0)),\"\",INDEX(Arkusz1!C:C,MATCH(ROW()-2,Arkusz1!$C:$C,0)))","v":""},{"$f":"IF(ISERROR(MATCH(ROW()-2,Arkusz1!$C:$C,0)),\"\",INDEX('import danych'!$A:$A,MATCH(ROW()-2,Arkusz1!$C:$C,0)+5))","v":""},null,{"$f":"IF(ISERROR(MATCH(ROW()-2,Arkusz1!$C:$C,0)),\"\",INDEX('import danych'!$B:$B,MATCH(ROW()-2,Arkusz1!$C:$C,0)+5))","v":""},{"$f":"IF(ISERROR(MATCH(ROW()-2,Arkusz1!$C:$C,0)),\"\",INDEX(Arkusz1!I:I,MATCH(ROW()-2,Arkusz1!$C:$C,0)))","v":""},{"$f":"IF(ISERROR(MATCH(ROW()-2,Arkusz1!$C:$C,0)),\"\",INDEX('import danych'!$H:$H,MATCH(ROW()-2,Arkusz1!$C:$C,0)+5))","v":""},{"$f":"IF(ISERROR(MATCH(ROW()-2,Arkusz1!$C:$C,0)),\"\",INDEX('import danych'!$L:$L,MATCH(ROW()-2,Arkusz1!$C:$C,0)+5))","v":""}]
[{"$f":"IF(ISERROR(MATCH(ROW()-2,Arkusz1!$C:$C,0)),\"\",INDEX(Arkusz1!C:C,MATCH(ROW()-2,Arkusz1!$C:$C,0)))","v":""},{"$f":"IF(ISERROR(MATCH(ROW()-2,Arkusz1!$C:$C,0)),\"\",INDEX('import danych'!$A:$A,MATCH(ROW()-2,Arkusz1!$C:$C,0)+5))","v":""},null,{"$f":"IF(ISERROR(MATCH(ROW()-2,Arkusz1!$C:$C,0)),\"\",INDEX('import danych'!$B:$B,MATCH(ROW()-2,Arkusz1!$C:$C,0)+5))","v":""},{"$f":"IF(ISERROR(MATCH(ROW()-2,Arkusz1!$C:$C,0)),\"\",INDEX(Arkusz1!I:I,MATCH(ROW()-2,Arkusz1!$C:$C,0)))","v":""},{"$f":"IF(ISERROR(MATCH(ROW()-2,Arkusz1!$C:$C,0)),\"\",INDEX('import danych'!$H:$H,MATCH(ROW()-2,Arkusz1!$C:$C,0)+5))","v":""},{"$f":"IF(ISERROR(MATCH(ROW()-2,Arkusz1!$C:$C,0)),\"\",INDEX('import danych'!$L:$L,MATCH(ROW()-2,Arkusz1!$C:$C,0)+5))","v":""}]
[{"$f":"IF(ISERROR(MATCH(ROW()-2,Arkusz1!$C:$C,0)),\"\",INDEX(Arkusz1!C:C,MATCH(ROW()-2,Arkusz1!$C:$C,0)))","v":""},{"$f":"IF(ISERROR(MATCH(ROW()-2,Arkusz1!$C:$C,0)),\"\",INDEX('import danych'!$A:$A,MATCH(ROW()-2,Arkusz1!$C:$C,0)+5))","v":""},null,{"$f":"IF(ISERROR(MATCH(ROW()-2,Arkusz1!$C:$C,0)),\"\",INDEX('import danych'!$B:$B,MATCH(ROW()-2,Arkusz1!$C:$C,0)+5))","v":""},{"$f":"IF(ISERROR(MATCH(ROW()-2,Arkusz1!$C:$C,0)),\"\",INDEX(Arkusz1!I:I,MATCH(ROW()-2,Arkusz1!$C:$C,0)))","v":""},{"$f":"IF(ISERROR(MATCH(ROW()-2,Arkusz1!$C:$C,0)),\"\",INDEX('import danych'!$H:$H,MATCH(ROW()-2,Arkusz1!$C:$C,0)+5))","v":""},{"$f":"IF(ISERROR(MATCH(ROW()-2,Arkusz1!$C:$C,0)),\"\",INDEX('import danych'!$L:$L,MATCH(ROW()-2,Arkusz1!$C:$C,0)+5))","v":""}]
[{"$f":"IF(ISERROR(MATCH(ROW()-2,Arkusz1!$C:$C,0)),\"\",INDEX(Arkusz1!C:C,MATCH(ROW()-2,Arkusz1!$C:$C,0)))","v":""},{"$f":"IF(ISERROR(MATCH(ROW()-2,Arkusz1!$C:$C,0)),\"\",INDEX('import danych'!$A:$A,MATCH(ROW()-2,Arkusz1!$C:$C,0)+5))","v":""},null,{"$f":"IF(ISERROR(MATCH(ROW()-2,Arkusz1!$C:$C,0)),\"\",INDEX('import danych'!$B:$B,MATCH(ROW()-2,Arkusz1!$C:$C,0)+5))","v":""},{"$f":"IF(ISERROR(MATCH(ROW()-2,Arkusz1!$C:$C,0)),\"\",INDEX(Arkusz1!I:I,MATCH(ROW()-2,Arkusz1!$C:$C,0)))","v":""},{"$f":"IF(ISERROR(MATCH(ROW()-2,Arkusz1!$C:$C,0)),\"\",INDEX('import danych'!$H:$H,MATCH(ROW()-2,Arkusz1!$C:$C,0)+5))","v":""},{"$f":"IF(ISERROR(MATCH(ROW()-2,Arkusz1!$C:$C,0)),\"\",INDEX('import danych'!$L:$L,MATCH(ROW()-2,Arkusz1!$C:$C,0)+5))","v":""}]
[{"$f":"IF(ISERROR(MATCH(ROW()-2,Arkusz1!$C:$C,0)),\"\",INDEX(Arkusz1!C:C,MATCH(ROW()-2,Arkusz1!$C:$C,0)))","v":""},{"$f":"IF(ISERROR(MATCH(ROW()-2,Arkusz1!$C:$C,0)),\"\",INDEX('import danych'!$A:$A,MATCH(ROW()-2,Arkusz1!$C:$C,0)+5))","v":""},null,{"$f":"IF(ISERROR(MATCH(ROW()-2,Arkusz1!$C:$C,0)),\"\",INDEX('import danych'!$B:$B,MATCH(ROW()-2,Arkusz1!$C:$C,0)+5))","v":""},{"$f":"IF(ISERROR(MATCH(ROW()-2,Arkusz1!$C:$C,0)),\"\",INDEX(Arkusz1!I:I,MATCH(ROW()-2,Arkusz1!$C:$C,0)))","v":""},{"$f":"IF(ISERROR(MATCH(ROW()-2,Arkusz1!$C:$C,0)),\"\",INDEX('import danych'!$H:$H,MATCH(ROW()-2,Arkusz1!$C:$C,0)+5))","v":""},{"$f":"IF(ISERROR(MATCH(ROW()-2,Arkusz1!$C:$C,0)),\"\",INDEX('import danych'!$L:$L,MATCH(ROW()-2,Arkusz1!$C:$C,0)+5))","v":""}]
[{"$f":"IF(ISERROR(MATCH(ROW()-2,Arkusz1!$C:$C,0)),\"\",INDEX(Arkusz1!C:C,MATCH(ROW()-2,Arkusz1!$C:$C,0)))","v":""},{"$f":"IF(ISERROR(MATCH(ROW()-2,Arkusz1!$C:$C,0)),\"\",INDEX('import danych'!$A:$A,MATCH(ROW()-2,Arkusz1!$C:$C,0)+5))","v":""},null,{"$f":"IF(ISERROR(MATCH(ROW()-2,Arkusz1!$C:$C,0)),\"\",INDEX('import danych'!$B:$B,MATCH(ROW()-2,Arkusz1!$C:$C,0)+5))","v":""},{"$f":"IF(ISERROR(MATCH(ROW()-2,Arkusz1!$C:$C,0)),\"\",INDEX(Arkusz1!I:I,MATCH(ROW()-2,Arkusz1!$C:$C,0)))","v":""},{"$f":"IF(ISERROR(MATCH(ROW()-2,Arkusz1!$C:$C,0)),\"\",INDEX('import danych'!$H:$H,MATCH(ROW()-2,Arkusz1!$C:$C,0)+5))","v":""},{"$f":"IF(ISERROR(MATCH(ROW()-2,Arkusz1!$C:$C,0)),\"\",INDEX('import danych'!$L:$L,MATCH(ROW()-2,Arkusz1!$C:$C,0)+5))","v":""}]
[{"$f":"IF(ISERROR(MATCH(ROW()-2,Arkusz1!$C:$C,0)),\"\",INDEX(Arkusz1!C:C,MATCH(ROW()-2,Arkusz1!$C:$C,0)))","v":""},{"$f":"IF(ISERROR(MATCH(ROW()-2,Arkusz1!$C:$C,0)),\"\",INDEX('import danych'!$A:$A,MATCH(ROW()-2,Arkusz1!$C:$C,0)+5))","v":""},null,{"$f":"IF(ISERROR(MATCH(ROW()-2,Arkusz1!$C:$C,0)),\"\",INDEX('import danych'!$B:$B,MATCH(ROW()-2,Arkusz1!$C:$C,0)+5))","v":""},{"$f":"IF(ISERROR(MATCH(ROW()-2,Arkusz1!$C:$C,0)),\"\",INDEX(Arkusz1!I:I,MATCH(ROW()-2,Arkusz1!$C:$C,0)))","v":""},{"$f":"IF(ISERROR(MATCH(ROW()-2,Arkusz1!$C:$C,0)),\"\",INDEX('import danych'!$H:$H,MATCH(ROW()-2,Arkusz1!$C:$C,0)+5))","v":""},{"$f":"IF(ISERROR(MATCH(ROW()-2,Arkusz1!$C:$C,0)),\"\",INDEX('import danych'!$L:$L,MATCH(ROW()-2,Arkusz1!$C:$C,0)+5))","v":""}]
[{"$f":"IF(ISERROR(MATCH(ROW()-2,Arkusz1!$C:$C,0)),\"\",INDEX(Arkusz1!C:C,MATCH(ROW()-2,Arkusz1!$C:$C,0)))","v":""},{"$f":"IF(ISERROR(MATCH(ROW()-2,Arkusz1!$C:$C,0)),\"\",INDEX('import danych'!$A:$A,MATCH(ROW()-2,Arkusz1!$C:$C,0)+5))","v":""},null,{"$f":"IF(ISERROR(MATCH(ROW()-2,Arkusz1!$C:$C,0)),\"\",INDEX('import danych'!$B:$B,MATCH(ROW()-2,Arkusz1!$C:$C,0)+5))","v":""},{"$f":"IF(ISERROR(MATCH(ROW()-2,Arkusz1!$C:$C,0)),\"\",INDEX(Arkusz1!I:I,MATCH(ROW()-2,Arkusz1!$C:$C,0)))","v":""},{"$f":"IF(ISERROR(MATCH(ROW()-2,Arkusz1!$C:$C,0)),\"\",INDEX('import danych'!$H:$H,MATCH(ROW()-2,Arkusz1!$C:$C,0)+5))","v":""},{"$f":"IF(ISERROR(MATCH(ROW()-2,Arkusz1!$C:$C,0)),\"\",INDEX('import danych'!$L:$L,MATCH(ROW()-2,Arkusz1!$C:$C,0)+5))","v":""}]
[{"$f":"IF(ISERROR(MATCH(ROW()-2,Arkusz1!$C:$C,0)),\"\",INDEX(Arkusz1!C:C,MATCH(ROW()-2,Arkusz1!$C:$C,0)))","v":""},{"$f":"IF(ISERROR(MATCH(ROW()-2,Arkusz1!$C:$C,0)),\"\",INDEX('import danych'!$A:$A,MATCH(ROW()-2,Arkusz1!$C:$C,0)+5))","v":""},null,{"$f":"IF(ISERROR(MATCH(ROW()-2,Arkusz1!$C:$C,0)),\"\",INDEX('import danych'!$B:$B,MATCH(ROW()-2,Arkusz1!$C:$C,0)+5))","v":""},{"$f":"IF(ISERROR(MATCH(ROW()-2,Arkusz1!$C:$C,0)),\"\",INDEX(Arkusz1!I:I,MATCH(ROW()-2,Arkusz1!$C:$C,0)))","v":""},{"$f":"IF(ISERROR(MATCH(ROW()-2,Arkusz1!$C:$C,0)),\"\",INDEX('import danych'!$H:$H,MATCH(ROW()-2,Arkusz1!$C:$C,0)+5))","v":""},{"$f":"IF(ISERROR(MATCH(ROW()-2,Arkusz1!$C:$C,0)),\"\",INDEX('import danych'!$L:$L,MATCH(ROW()-2,Arkusz1!$C:$C,0)+5))","v":""}]
[{"$f":"IF(ISERROR(MATCH(ROW()-2,Arkusz1!$C:$C,0)),\"\",INDEX(Arkusz1!C:C,MATCH(ROW()-2,Arkusz1!$C:$C,0)))","v":""},{"$f":"IF(ISERROR(MATCH(ROW()-2,Arkusz1!$C:$C,0)),\"\",INDEX('import danych'!$A:$A,MATCH(ROW()-2,Arkusz1!$C:$C,0)+5))","v":""},null,{"$f":"IF(ISERROR(MATCH(ROW()-2,Arkusz1!$C:$C,0)),\"\",INDEX('import danych'!$B:$B,MATCH(ROW()-2,Arkusz1!$C:$C,0)+5))","v":""},{"$f":"IF(ISERROR(MATCH(ROW()-2,Arkusz1!$C:$C,0)),\"\",INDEX(Arkusz1!I:I,MATCH(ROW()-2,Arkusz1!$C:$C,0)))","v":""},{"$f":"IF(ISERROR(MATCH(ROW()-2,Arkusz1!$C:$C,0)),\"\",INDEX('import danych'!$H:$H,MATCH(ROW()-2,Arkusz1!$C:$C,0)+5))","v":""},{"$f":"IF(ISERROR(MATCH(ROW()-2,Arkusz1!$C:$C,0)),\"\",INDEX('import danych'!$L:$L,MATCH(ROW()-2,Arkusz1!$C:$C,0)+5))","v":""}]
[{"$f":"IF(ISERROR(MATCH(ROW()-2,Arkusz1!$C:$C,0)),\"\",INDEX(Arkusz1!C:C,MATCH(ROW()-2,Arkusz1!$C:$C,0)))","v":""},{"$f":"IF(ISERROR(MATCH(ROW()-2,Arkusz1!$C:$C,0)),\"\",INDEX('import danych'!$A:$A,MATCH(ROW()-2,Arkusz1!$C:$C,0)+5))","v":""},null,{"$f":"IF(ISERROR(MATCH(ROW()-2,Arkusz1!$C:$C,0)),\"\",INDEX('import danych'!$B:$B,MATCH(ROW()-2,Arkusz1!$C:$C,0)+5))","v":""},{"$f":"IF(ISERROR(MATCH(ROW()-2,Arkusz1!$C:$C,0)),\"\",INDEX(Arkusz1!I:I,MATCH(ROW()-2,Arkusz1!$C:$C,0)))","v":""},{"$f":"IF(ISERROR(MATCH(ROW()-2,Arkusz1!$C:$C,0)),\"\",INDEX('import danych'!$H:$H,MATCH(ROW()-2,Arkusz1!$C:$C,0)+5))","v":""},{"$f":"IF(ISERROR(MATCH(ROW()-2,Arkusz1!$C:$C,0)),\"\",INDEX('import danych'!$L:$L,MATCH(ROW()-2,Arkusz1!$C:$C,0)+5))","v":""}]
[{"$f":"IF(ISERROR(MATCH(ROW()-2,Arkusz1!$C:$C,0)),\"\",INDEX(Arkusz1!C:C,MATCH(ROW()-2,Arkusz1!$C:$C,0)))","v":""},{"$f":"IF(ISERROR(MATCH(ROW()-2,Arkusz1!$C:$C,0)),\"\",INDEX('import danych'!$A:$A,MATCH(ROW()-2,Arkusz1!$C:$C,0)+5))","v":""},null,{"$f":"IF(ISERROR(MATCH(ROW()-2,Arkusz1!$C:$C,0)),\"\",INDEX('import danych'!$B:$B,MATCH(ROW()-2,Arkusz1!$C:$C,0)+5))","v":""},{"$f":"IF(ISERROR(MATCH(ROW()-2,Arkusz1!$C:$C,0)),\"\",INDEX(Arkusz1!I:I,MATCH(ROW()-2,Arkusz1!$C:$C,0)))","v":""},{"$f":"IF(ISERROR(MATCH(ROW()-2,Arkusz1!$C:$C,0)),\"\",INDEX('import danych'!$H:$H,MATCH(ROW()-2,Arkusz1!$C:$C,0)+5))","v":""},{"$f":"IF(ISERROR(MATCH(ROW()-2,Arkusz1!$C:$C,0)),\"\",INDEX('import danych'!$L:$L,MATCH(ROW()-2,Arkusz1!$C:$C,0)+5))","v":""}]

{"sheet":"import danych","index":1,"n_rows":150,"n_cols":12,"rows_kept":150}
[{"$f":"IF([1]Sheet1!A1=\"\",\"\",[1]Sheet1!A1)","v":""},{"$f":"IF([1]Sheet1!B1=\"\",\"\",[1]Sheet1!B1)","v":""},{"$f":"IF([1]Sheet1!C1=\"\",\"\",[1]Sheet1!C1)","v":""},{"$f":"IF([1]Sheet1!D1=\"\",\"\",[1]Sheet1!D1)","v":""},{"$f":"IF([1]Sheet1!E1=\"\",\"\",[1]Sheet1!E1)","v":""},{"$f":"IF([1]Sheet1!F1=\"\",\"\",[1]Sheet1!F1)","v":""},{"$f":"IF([1]Sheet1!G1=\"\",\"\",[1]Sheet1!G1)","v":""},{"$f":"IF([1]Sheet1!H1=\"\",\"\",[1]Sheet1!H1)","v":""},{"$f":"IF([1]Sheet1!I1=\"\",\"\",[1]Sheet1!I1)","v":""},{"$f":"IF([1]Sheet1!J1=\"\",\"\",[1]Sheet1!J1)","v":""},{"$f":"IF([1]Sheet1!K1=\"\",\"\",[1]Sheet1!K1)","v":""},{"$f":"IF([1]Sheet1!L1=\"\",\"\",[1]Sheet1!L1)","v":""}]
[null,{"$f":"IF([1]Sheet1!B2=\"\",\"\",[1]Sheet1!B2)","v":""},{"$f":"IF([1]Sheet1!C2=\"\",\"\",[1]Sheet1!C2)","v":""},{"$f":"IF([1]Sheet1!D2=\"\",\"\",[1]Sheet1!D2)","v":""},{"$f":"IF([1]Sheet1!E2=\"\",\"\",[1]Sheet1!E2)","v":""},{"$f":"IF([1]Sheet1!F2=\"\",\"\",[1]Sheet1!F2)","v":""},{"$f":"IF([1]Sheet1!G2=\"\",\"\",[1]Sheet1!G2)","v":""},{"$f":"IF([1]Sheet1!H2=\"\",\"\",[1]Sheet1!H2)","v":""},{"$f":"IF([1]Sheet1!I2=\"\",\"\",[1]Sheet1!I2)","v":""},{"$f":"IF([1]Sheet1!J2=\"\",\"\",[1]Sheet1!J2)","v":""},{"$f":"IF([1]Sheet1!K2=\"\",\"\",[1]Sheet1!K2)","v":""},{"$f":"IF([1]Sheet1!L2=\"\",\"\",[1]Sheet1!L2)","v":"2012-11-02  14:07:37"}]
[{"$f":"IF([1]Sheet1!A3=\"\",\"\",[1]Sheet1!A3)","v":""},{"$f":"IF([1]Sheet1!B3=\"\",\"\",[1]Sheet1!B3)","v":""},{"$f":"IF([1]Sheet1!C3=\"\",\"\",[1]Sheet1!C3)","v":""},{"$f":"IF([1]Sheet1!D3=\"\",\"\",[1]Sheet1!D3)","v":""},{"$f":"IF([1]Sheet1!E3=\"\",\"\",[1]Sheet1!E3)","v":""},{"$f":"IF([1]Sheet1!F3=\"\",\"\",[1]Sheet1!F3)","v":"Lista odbiorców"},{"$f":"IF([1]Sheet1!G3=\"\",\"\",[1]Sheet1!G3)","v":""},{"$f":"IF([1]Sheet1!H3=\"\",\"\",[1]Sheet1!H3)","v":""},{"$f":"IF([1]Sheet1!I3=\"\",\"\",[1]Sheet1!I3)","v":""},{"$f":"IF([1]Sheet1!J3=\"\",\"\",[1]Sheet1!J3)","v":""},{"$f":"IF([1]Sheet1!K3=\"\",\"\",[1]Sheet1!K3)","v":""},{"$f":"IF([1]Sheet1!L3=\"\",\"\",[1]Sheet1!L3)","v":""}]
[{"$f":"IF([1]Sheet1!A4=\"\",\"\",[1]Sheet1!A4)","v":""},{"$f":"IF([1]Sheet1!B4=\"\",\"\",[1]Sheet1!B4)","v":""},{"$f":"IF([1]Sheet1!C4=\"\",\"\",[1]Sheet1!C4)","v":""},{"$f":"IF([1]Sheet1!D4=\"\",\"\",[1]Sheet1!D4)","v":""},{"$f":"IF([1]Sheet1!E4=\"\",\"\",[1]Sheet1!E4)","v":""},{"$f":"IF([1]Sheet1!F4=\"\",\"\",[1]Sheet1!F4)","v":""},{"$f":"IF([1]Sheet1!G4=\"\",\"\",[1]Sheet1!G4)","v":""},{"$f":"IF([1]Sheet1!H4=\"\",\"\",[1]Sheet1!H4)","v":""},{"$f":"IF([1]Sheet1!I4=\"\",\"\",[1]Sheet1!I4)","v":""},{"$f":"IF([1]Sheet1!J4=\"\",\"\",[1]Sheet1!J4)","v":""},{"$f":"IF([1]Sheet1!K4=\"\",\"\",[1]Sheet1!K4)","v":""},{"$f":"IF([1]Sheet1!L4=\"\",\"\",[1]Sheet1!L4)","v":""}]
[{"$f":"IF([1]Sheet1!A5=\"\",\"\",[1]Sheet1!A5)","v":"Data"},{"$f":"IF([1]Sheet1!B5=\"\",\"\",[1]Sheet1!B5)","v":"Godzina"},{"$f":"IF([1]Sheet1!C5=\"\",\"\",[1]Sheet1!C5)","v":"Dystrybutor"},{"$f":"IF([1]Sheet1!D5=\"\",\"\",[1]Sheet1!D5)","v":"Nr._rejestracyjny"},null,"Pracownik",{"$f":"IF([1]Sheet1!G5=\"\",\"\",[1]Sheet1!G5)","v":""},{"$f":"IF([1]Sheet1!H5=\"\",\"\",[1]Sheet1!H5)","v":"Przebieg"},{"$f":"IF([1]Sheet1!I5=\"\",\"\",[1]Sheet1!I5)","v":"Operator"},{"$f":"IF([1]Sheet1!J5=\"\",\"\",[1]Sheet1!J5)","v":""},{"$f":"IF([1]Sheet1!K5=\"\",\"\",[1]Sheet1!K5)","v":""},{"$f":"IF([1]Sheet1!L5=\"\",\"\",[1]Sheet1!L5)","v":"Ilosc"}]
[{"$f":"IF([1]Sheet1!A6=\"\",\"\",[1]Sheet1!A6)","v":""},{"$f":"IF([1]Sheet1!B6=\"\",\"\",[1]Sheet1!B6)","v":""},{"$f":"IF([1]Sheet1!C6=\"\",\"\",[1]Sheet1!C6)","v":""},{"$f":"IF([1]Sheet1!D6=\"\",\"\",[1]Sheet1!D6)","v":""},null,null,{"$f":"IF([1]Sheet1!G6=\"\",\"\",[1]Sheet1!G6)","v":""},{"$f":"IF([1]Sheet1!H6=\"\",\"\",[1]Sheet1!H6)","v":""},{"$f":"IF([1]Sheet1!I6=\"\",\"\",[1]Sheet1!I6)","v":""},{"$f":"IF([1]Sheet1!J6=\"\",\"\",[1]Sheet1!J6)","v":""},{"$f":"IF([1]Sheet1!K6=\"\",\"\",[1]Sheet1!K6)","v":""},{"$f":"IF([1]Sheet1!L6=\"\",\"\",[1]Sheet1!L6)","v":""}]
[{"$f":"IF([1]Sheet1!A7=\"\",\"\",[1]Sheet1!A7)","v":"2012-09-20"},{"$f":"IF([1]Sheet1!B7=\"\",\"\",[1]Sheet1!B7)","v":"13:24"},{"$f":"IF([1]Sheet1!C7=\"\",\"\",[1]Sheet1!C7)","v":1},{"$f":"IF([1]Sheet1!D7=\"\",\"\",[1]Sheet1!D7)","v":"TEST1"},{"$f":"COUNTIF(D7,\"???\")","v":0},{"$f":"IF(E7=0,\"00\"&D7,D7)","v":"00TEST1"},{"$f":"IF([1]Sheet1!G7=\"\",\"\",[1]Sheet1!G7)","v":""},{"$f":"IF([1]Sheet1!H7=\"\",\"\",[1]Sheet1!H7)","v":13319},{"$f":"IF([1]Sheet1!I7=\"\",\"\",[1]Sheet1!I7)","v":"LINDE 01"},{"$f":"IF([1]Sheet1!J7=\"\",\"\",[1]Sheet1!J7)","v":""},{"$f":"IF([1]Sheet1!K7=\"\",\"\",[1]Sheet1!K7)","v":""},{"$f":"IF([1]Sheet1!L7=\"\",\"\",[1]Sheet1!L7)","v":1.55}]
[{"$f":"IF([1]Sheet1!A8=\"\",\"\",[1]Sheet1!A8)","v":"2012-09-21"},{"$f":"IF([1]Sheet1!B8=\"\",\"\",[1]Sheet1!B8)","v":"13:04"},{"$f":"IF([1]Sheet1!C8=\"\",\"\",[1]Sheet1!C8)","v":1},{"$f":"IF([1]Sheet1!D8=\"\",\"\",[1]Sheet1!D8)","v":"016"},{"$f":"COUNTIF(D8,\"???\")","v":1},{"$f":"IF(E8=0,\"00\"&D8,D8)","v":"016"},{"$f":"IF([1]Sheet1!G8=\"\",\"\",[1]Sheet1!G8)","v":""},{"$f":"IF([1]Sheet1!H8=\"\",\"\",[1]Sheet1!H8)","v":19366},{"$f":"IF([1]Sheet1!I8=\"\",\"\",[1]Sheet1!I8)","v":"LINDE 03"},{"$f":"IF([1]Sheet1!J8=\"\",\"\",[1]Sheet1!J8)","v":""},{"$f":"IF([1]Sheet1!K8=\"\",\"\",[1]Sheet1!K8)","v":""},{"$f":"IF([1]Sheet1!L8=\"\",\"\",[1]Sheet1!L8)","v":36.63}]
[{"$f":"IF([1]Sheet1!A9=\"\",\"\",[1]Sheet1!A9)","v":"2012-09-21"},{"$f":"IF([1]Sheet1!B9=\"\",\"\",[1]Sheet1!B9)","v":"13:08"},{"$f":"IF([1]Sheet1!C9=\"\",\"\",[1]Sheet1!C9)","v":1},{"$f":"IF([1]Sheet1!D9=\"\",\"\",[1]Sheet1!D9)","v":"002"},1,"002",{"$f":"IF([1]Sheet1!G9=\"\",\"\",[1]Sheet1!G9)","v":""},{"$f":"IF([1]Sheet1!H9=\"\",\"\",[1]Sheet1!H9)","v":13337},{"$f":"IF([1]Sheet1!I9=\"\",\"\",[1]Sheet1!I9)","v":"LINDE 01"},{"$f":"IF([1]Sheet1!J9=\"\",\"\",[1]Sheet1!J9)","v":""},{"$f":"IF([1]Sheet1!K9=\"\",\"\",[1]Sheet1!K9)","v":""},{"$f":"IF([1]Sheet1!L9=\"\",\"\",[1]Sheet1!L9)","v":44.480000000000004}]
[{"$f":"IF([1]Sheet1!A10=\"\",\"\",[1]Sheet1!A10)","v":"2012-09-21"},{"$f":"IF([1]Sheet1!B10=\"\",\"\",[1]Sheet1!B10)","v":"13:13"},{"$f":"IF([1]Sheet1!C10=\"\",\"\",[1]Sheet1!C10)","v":1},{"$f":"IF([1]Sheet1!D10=\"\",\"\",[1]Sheet1!D10)","v":"006"},1,"006",{"$f":"IF([1]Sheet1!G10=\"\",\"\",[1]Sheet1!G10)","v":""},{"$f":"IF([1]Sheet1!H10=\"\",\"\",[1]Sheet1!H10)","v":14133},{"$f":"IF([1]Sheet1!I10=\"\",\"\",[1]Sheet1!I10)","v":"LINDE 02"},{"$f":"IF([1]Sheet1!J10=\"\",\"\",[1]Sheet1!J10)","v":""},{"$f":"IF([1]Sheet1!K10=\"\",\"\",[1]Sheet1!K10)","v":""},{"$f":"IF([1]Sheet1!L10=\"\",\"\",[1]Sheet1!L10)","v":45.93}]
[{"$f":"IF([1]Sheet1!A11=\"\",\"\",[1]Sheet1!A11)","v":"2012-09-22"},{"$f":"IF([1]Sheet1!B11=\"\",\"\",[1]Sheet1!B11)","v":"12:54"},{"$f":"IF([1]Sheet1!C11=\"\",\"\",[1]Sheet1!C11)","v":1},{"$f":"IF([1]Sheet1!D11=\"\",\"\",[1]Sheet1!D11)","v":"002"},1,"002",{"$f":"IF([1]Sheet1!G11=\"\",\"\",[1]Sheet1!G11)","v":""},{"$f":"IF([1]Sheet1!H11=\"\",\"\",[1]Sheet1!H11)","v":13348},{"$f":"IF([1]Sheet1!I11=\"\",\"\",[1]Sheet1!I11)","v":"LINDE 01"},{"$f":"IF([1]Sheet1!J11=\"\",\"\",[1]Sheet1!J11)","v":""},{"$f":"IF([1]Sheet1!K11=\"\",\"\",[1]Sheet1!K11)","v":""},{"$f":"IF([1]Sheet1!L11=\"\",\"\",[1]Sheet1!L11)","v":31.27}]
[{"$f":"IF([1]Sheet1!A12=\"\",\"\",[1]Sheet1!A12)","v":"2012-09-22"},{"$f":"IF([1]Sheet1!B12=\"\",\"\",[1]Sheet1!B12)","v":"12:57"},{"$f":"IF([1]Sheet1!C12=\"\",\"\",[1]Sheet1!C12)","v":1},{"$f":"IF([1]Sheet1!D12=\"\",\"\",[1]Sheet1!D12)","v":"006"},1,"006",{"$f":"IF([1]Sheet1!G12=\"\",\"\",[1]Sheet1!G12)","v":""},{"$f":"IF([1]Sheet1!H12=\"\",\"\",[1]Sheet1!H12)","v":14150},{"$f":"IF([1]Sheet1!I12=\"\",\"\",[1]Sheet1!I12)","v":"LINDE 02"},{"$f":"IF([1]Sheet1!J12=\"\",\"\",[1]Sheet1!J12)","v":""},{"$f":"IF([1]Sheet1!K12=\"\",\"\",[1]Sheet1!K12)","v":""},{"$f":"IF([1]Sheet1!L12=\"\",\"\",[1]Sheet1!L12)","v":47.21}]
[{"$f":"IF([1]Sheet1!A13=\"\",\"\",[1]Sheet1!A13)","v":"2012-09-22"},{"$f":"IF([1]Sheet1!B13=\"\",\"\",[1]Sheet1!B13)","v":"13:03"},{"$f":"IF([1]Sheet1!C13=\"\",\"\",[1]Sheet1!C13)","v":1},{"$f":"IF([1]Sheet1!D13=\"\",\"\",[1]Sheet1!D13)","v":"014"},1,"014",{"$f":"IF([1]Sheet1!G13=\"\",\"\",[1]Sheet1!G13)","v":""},{"$f":"IF([1]Sheet1!H13=\"\",\"\",[1]Sheet1!H13)","v":19373},{"$f":"IF([1]Sheet1!I13=\"\",\"\",[1]Sheet1!I13)","v":"LINDE 03"},{"$f":"IF([1]Sheet1!J13=\"\",\"\",[1]Sheet1!J13)","v":""},{"$f":"IF([1]Sheet1!K13=\"\",\"\",[1]Sheet1!K13)","v":""},{"$f":"IF([1]Sheet1!L13=\"\",\"\",[1]Sheet1!L13)","v":17.2}]
[{"$f":"IF([1]Sheet1!A14=\"\",\"\",[1]Sheet1!A14)","v":"2012-09-24"},{"$f":"IF([1]Sheet1!B14=\"\",\"\",[1]Sheet1!B14)","v":"12:31"},{"$f":"IF([1]Sheet1!C14=\"\",\"\",[1]Sheet1!C14)","v":1},{"$f":"IF([1]Sheet1!D14=\"\",\"\",[1]Sheet1!D14)","v":"005"},1,"005",{"$f":"IF([1]Sheet1!G14=\"\",\"\",[1]Sheet1!G14)","v":""},{"$f":"IF([1]Sheet1!H14=\"\",\"\",[1]Sheet1!H14)","v":14165},{"$f":"IF([1]Sheet1!I14=\"\",\"\",[1]Sheet1!I14)","v":"LINDE 02"},{"$f":"IF([1]Sheet1!J14=\"\",\"\",[1]Sheet1!J14)","v":""},{"$f":"IF([1]Sheet1!K14=\"\",\"\",[1]Sheet1!K14)","v":""},{"$f":"IF([1]Sheet1!L14=\"\",\"\",[1]Sheet1!L14)","v":35.7}]
[{"$f":"IF([1]Sheet1!A15=\"\",\"\",[1]Sheet1!A15)","v":"2012-09-24"},{"$f":"IF([1]Sheet1!B15=\"\",\"\",[1]Sheet1!B15)","v":"12:36"},{"$f":"IF([1]Sheet1!C15=\"\",\"\",[1]Sheet1!C15)","v":1},{"$f":"IF([1]Sheet1!D15=\"\",\"\",[1]Sheet1!D15)","v":"101"},1,"101",{"$f":"IF([1]Sheet1!G15=\"\",\"\",[1]Sheet1!G15)","v":""},{"$f":"IF([1]Sheet1!H15=\"\",\"\",[1]Sheet1!H15)","v":13354},{"$f":"IF([1]Sheet1!I15=\"\",\"\",[1]Sheet1!I15)","v":"LINDE 01"},{"$f":"IF([1]Sheet1!J15=\"\",\"\",[1]Sheet1!J15)","v":""},{"$f":"IF([1]Sheet1!K15=\"\",\"\",[1]Sheet1!K15)","v":""},{"$f":"IF([1]Sheet1!L15=\"\",\"\",[1]Sheet1!L15)","v":14.63}]
[{"$f":"IF([1]Sheet1!A16=\"\",\"\",[1]Sheet1!A16)","v":"2012-09-25"},{"$f":"IF([1]Sheet1!B16=\"\",\"\",[1]Sheet1!B16)","v":"08:53"},{"$f":"IF([1]Sheet1!C16=\"\",\"\",[1]Sheet1!C16)","v":1},{"$f":"IF([1]Sheet1!D16=\"\",\"\",[1]Sheet1!D16)","v":"001"},1,"001",{"$f":"IF([1]Sheet1!G16=\"\",\"\",[1]Sheet1!G16)","v":""},{"$f":"IF([1]Sheet1!H16=\"\",\"\",[1]Sheet1!H16)","v":13371},{"$f":"IF([1]Sheet1!I16=\"\",\"\",[1]Sheet1!I16)","v":"LINDE 01"},{"$f":"IF([1]Sheet1!J16=\"\",\"\",[1]Sheet1!J16)","v":""},{"$f":"IF([1]Sheet1!K16=\"\",\"\",[1]Sheet1!K16)","v":""},{"$f":"IF([1]Sheet1!L16=\"\",\"\",[1]Sheet1!L16)","v":43.92}]
[{"$f":"IF([1]Sheet1!A17=\"\",\"\",[1]Sheet1!A17)","v":"2012-09-25"},{"$f":"IF([1]Sheet1!B17=\"\",\"\",[1]Sheet1!B17)","v":"08:56"},{"$f":"IF([1]Sheet1!C17=\"\",\"\",[1]Sheet1!C17)","v":1},{"$f":"IF([1]Sheet1!D17=\"\",\"\",[1]Sheet1!D17)","v":"005"},1,"005",{"$f":"IF([1]Sheet1!G17=\"\",\"\",[1]Sheet1!G17)","v":""},{"$f":"IF([1]Sheet1!H17=\"\",\"\",[1]Sheet1!H17)","v":14175},{"$f":"IF([1]Sheet1!I17=\"\",\"\",[1]Sheet1!I17)","v":"LINDE 02"},{"$f":"IF([1]Sheet1!J17=\"\",\"\",[1]Sheet1!J17)","v":""},{"$f":"IF([1]Sheet1!K17=\"\",\"\",[1]Sheet1!K17)","v":""},{"$f":"IF([1]Sheet1!L17=\"\",\"\",[1]Sheet1!L17)","v":28.71}]
[{"$f":"IF([1]Sheet1!A18=\"\",\"\",[1]Sheet1!A18)","v":"2012-09-25"},{"$f":"IF([1]Sheet1!B18=\"\",\"\",[1]Sheet1!B18)","v":"10:25"},{"$f":"IF([1]Sheet1!C18=\"\",\"\",[1]Sheet1!C18)","v":1},{"$f":"IF([1]Sheet1!D18=\"\",\"\",[1]Sheet1!D18)","v":"011"},1,"011",{"$f":"IF([1]Sheet1!G18=\"\",\"\",[1]Sheet1!G18)","v":""},{"$f":"IF([1]Sheet1!H18=\"\",\"\",[1]Sheet1!H18)","v":19385},{"$f":"IF([1]Sheet1!I18=\"\",\"\",[1]Sheet1!I18)","v":"LINDE 03"},{"$f":"IF([1]Sheet1!J18=\"\",\"\",[1]Sheet1!J18)","v":""},{"$f":"IF([1]Sheet1!K18=\"\",\"\",[1]Sheet1!K18)","v":""},{"$f":"IF([1]Sheet1!L18=\"\",\"\",[1]Sheet1!L18)","v":36.41}]
[{"$f":"IF([1]Sheet1!A19=\"\",\"\",[1]Sheet1!A19)","v":"2012-09-26"},{"$f":"IF([1]Sheet1!B19=\"\",\"\",[1]Sheet1!B19)","v":"09:33"},{"$f":"IF([1]Sheet1!C19=\"\",\"\",[1]Sheet1!C19)","v":1},{"$f":"IF([1]Sheet1!D19=\"\",\"\",[1]Sheet1!D19)","v":"005"},1,"005",{"$f":"IF([1]Sheet1!G19=\"\",\"\",[1]Sheet1!G19)","v":""},{"$f":"IF([1]Sheet1!H19=\"\",\"\",[1]Sheet1!H19)","v":14192},{"$f":"IF([1]Sheet1!I19=\"\",\"\",[1]Sheet1!I19)","v":"LINDE 02"},{"$f":"IF([1]Sheet1!J19=\"\",\"\",[1]Sheet1!J19)","v":""},{"$f":"IF([1]Sheet1!K19=\"\",\"\",[1]Sheet1!K19)","v":""},{"$f":"IF([1]Sheet1!L19=\"\",\"\",[1]Sheet1!L19)","v":45.92}]
[{"$f":"IF([1]Sheet1!A20=\"\",\"\",[1]Sheet1!A20)","v":"2012-09-26"},{"$f":"IF([1]Sheet1!B20=\"\",\"\",[1]Sheet1!B20)","v":"09:36"},{"$f":"IF([1]Sheet1!C20=\"\",\"\",[1]Sheet1!C20)","v":1},{"$f":"IF([1]Sheet1!D20=\"\",\"\",[1]Sheet1!D20)","v":"001"},1,"001",{"$f":"IF([1]Sheet1!G20=\"\",\"\",[1]Sheet1!G20)","v":""},{"$f":"IF([1]Sheet1!H20=\"\",\"\",[1]Sheet1!H20)","v":13386},{"$f":"IF([1]Sheet1!I20=\"\",\"\",[1]Sheet1!I20)","v":"LINDE 01"},{"$f":"IF([1]Sheet1!J20=\"\",\"\",[1]Sheet1!J20)","v":""},{"$f":"IF([1]Sheet1!K20=\"\",\"\",[1]Sheet1!K20)","v":""},{"$f":"IF([1]Sheet1!L20=\"\",\"\",[1]Sheet1!L20)","v":41.02}]
[{"$f":"IF([1]Sheet1!A21=\"\",\"\",[1]Sheet1!A21)","v":"2012-09-27"},{"$f":"IF([1]Sheet1!B21=\"\",\"\",[1]Sheet1!B21)","v":"07:18"},{"$f":"IF([1]Sheet1!C21=\"\",\"\",[1]Sheet1!C21)","v":1},{"$f":"IF([1]Sheet1!D21=\"\",\"\",[1]Sheet1!D21)","v":"007"},1,"007",{"$f":"IF([1]Sheet1!G21=\"\",\"\",[1]Sheet1!G21)","v":""},{"$f":"IF([1]Sheet1!H21=\"\",\"\",[1]Sheet1!H21)","v":14209},{"$f":"IF([1]Sheet1!I21=\"\",\"\",[1]Sheet1!I21)","v":"LINDE 02"},{"$f":"IF([1]Sheet1!J21=\"\",\"\",[1]Sheet1!J21)","v":""},{"$f":"IF([1]Sheet1!K21=\"\",\"\",[1]Sheet1!K21)","v":""},{"$f":"IF([1]Sheet1!L21=\"\",\"\",[1]Sheet1!L21)","v":49.75}]
[{"$f":"IF([1]Sheet1!A22=\"\",\"\",[1]Sheet1!A22)","v":"2012-09-27"},{"$f":"IF([1]Sheet1!B22=\"\",\"\",[1]Sheet1!B22)","v":"11:32"},{"$f":"IF([1]Sheet1!C22=\"\",\"\",[1]Sheet1!C22)","v":1},{"$f":"IF([1]Sheet1!D22=\"\",\"\",[1]Sheet1!D22)","v":"003"},1,"003",{"$f":"IF([1]Sheet1!G22=\"\",\"\",[1]Sheet1!G22)","v":""},{"$f":"IF([1]Sheet1!H22=\"\",\"\",[1]Sheet1!H22)","v":13398},{"$f":"IF([1]Sheet1!I22=\"\",\"\",[1]Sheet1!I22)","v":"LINDE 01"},{"$f":"IF([1]Sheet1!J22=\"\",\"\",[1]Sheet1!J22)","v":""},{"$f":"IF([1]Sheet1!K22=\"\",\"\",[1]Sheet1!K22)","v":""},{"$f":"IF([1]Sheet1!L22=\"\",\"\",[1]Sheet1!L22)","v":32.57}]
[{"$f":"IF([1]Sheet1!A23=\"\",\"\",[1]Sheet1!A23)","v":"2012-09-27"},{"$f":"IF([1]Sheet1!B23=\"\",\"\",[1]Sheet1!B23)","v":"13:01"},{"$f":"IF([1]Sheet1!C23=\"\",\"\",[1]Sheet1!C23)","v":1},{"$f":"IF([1]Sheet1!D23=\"\",\"\",[1]Sheet1!D23)","v":"017"},1,"017",{"$f":"IF([1]Sheet1!G23=\"\",\"\",[1]Sheet1!G23)","v":""},19400,{"$f":"IF([1]Sheet1!I23=\"\",\"\",[1]Sheet1!I23)","v":"LINDE 03"},{"$f":"IF([1]Sheet1!J23=\"\",\"\",[1]Sheet1!J23)","v":""},{"$f":"IF([1]Sheet1!K23=\"\",\"\",[1]Sheet1!K23)","v":""},{"$f":"IF([1]Sheet1!L23=\"\",\"\",[1]Sheet1!L23)","v":35.27}]
[{"$f":"IF([1]Sheet1!A24=\"\",\"\",[1]Sheet1!A24)","v":"2012-09-28"},{"$f":"IF([1]Sheet1!B24=\"\",\"\",[1]Sheet1!B24)","v":"10:11"},{"$f":"IF([1]Sheet1!C24=\"\",\"\",[1]Sheet1!C24)","v":1},{"$f":"IF([1]Sheet1!D24=\"\",\"\",[1]Sheet1!D24)","v":"003"},1,"003",{"$f":"IF([1]Sheet1!G24=\"\",\"\",[1]Sheet1!G24)","v":""},{"$f":"IF([1]Sheet1!H24=\"\",\"\",[1]Sheet1!H24)","v":13417},{"$f":"IF([1]Sheet1!I24=\"\",\"\",[1]Sheet1!I24)","v":"LINDE 01"},{"$f":"IF([1]Sheet1!J24=\"\",\"\",[1]Sheet1!J24)","v":""},{"$f":"IF([1]Sheet1!K24=\"\",\"\",[1]Sheet1!K24)","v":""},{"$f":"IF([1]Sheet1!L24=\"\",\"\",[1]Sheet1!L24)","v":52.800000000000004}]
[{"$f":"IF([1]Sheet1!A25=\"\",\"\",[1]Sheet1!A25)","v":"2012-09-28"},{"$f":"IF([1]Sheet1!B25=\"\",\"\",[1]Sheet1!B25)","v":"11:10"},{"$f":"IF([1]Sheet1!C25=\"\",\"\",[1]Sheet1!C25)","v":1},{"$f":"IF([1]Sheet1!D25=\"\",\"\",[1]Sheet1!D25)","v":"007"},1,"007",{"$f":"IF([1]Sheet1!G25=\"\",\"\",[1]Sheet1!G25)","v":""},{"$f":"IF([1]Sheet1!H25=\"\",\"\",[1]Sheet1!H25)","v":14223},{"$f":"IF([1]Sheet1!I25=\"\",\"\",[1]Sheet1!I25)","v":"LINDE 02"},{"$f":"IF([1]Sheet1!J25=\"\",\"\",[1]Sheet1!J25)","v":""},{"$f":"IF([1]Sheet1!K25=\"\",\"\",[1]Sheet1!K25)","v":""},{"$f":"IF([1]Sheet1!L25=\"\",\"\",[1]Sheet1!L25)","v":38.34}]
[{"$f":"IF([1]Sheet1!A26=\"\",\"\",[1]Sheet1!A26)","v":"2012-09-30"},{"$f":"IF([1]Sheet1!B26=\"\",\"\",[1]Sheet1!B26)","v":"07:30"},{"$f":"IF([1]Sheet1!C26=\"\",\"\",[1]Sheet1!C26)","v":1},{"$f":"IF([1]Sheet1!D26=\"\",\"\",[1]Sheet1!D26)","v":"017"},1,"017",{"$f":"IF([1]Sheet1!G26=\"\",\"\",[1]Sheet1!G26)","v":""},{"$f":"IF([1]Sheet1!H26=\"\",\"\",[1]Sheet1!H26)","v":19419},{"$f":"IF([1]Sheet1!I26=\"\",\"\",[1]Sheet1!I26)","v":"LINDE 03"},{"$f":"IF([1]Sheet1!J26=\"\",\"\",[1]Sheet1!J26)","v":""},{"$f":"IF([1]Sheet1!K26=\"\",\"\",[1]Sheet1!K26)","v":""},{"$f":"IF([1]Sheet1!L26=\"\",\"\",[1]Sheet1!L26)","v":41.62}]
[{"$f":"IF([1]Sheet1!A27=\"\",\"\",[1]Sheet1!A27)","v":"2012-09-30"},{"$f":"IF([1]Sheet1!B27=\"\",\"\",[1]Sheet1!B27)","v":"08:45"},{"$f":"IF([1]Sheet1!C27=\"\",\"\",[1]Sheet1!C27)","v":1},{"$f":"IF([1]Sheet1!D27=\"\",\"\",[1]Sheet1!D27)","v":"003"},1,"003",{"$f":"IF([1]Sheet1!G27=\"\",\"\",[1]Sheet1!G27)","v":""},{"$f":"IF([1]Sheet1!H27=\"\",\"\",[1]Sheet1!H27)","v":13435},{"$f":"IF([1]Sheet1!I27=\"\",\"\",[1]Sheet1!I27)","v":"LINDE 01"},{"$f":"IF([1]Sheet1!J27=\"\",\"\",[1]Sheet1!J27)","v":""},{"$f":"IF([1]Sheet1!K27=\"\",\"\",[1]Sheet1!K27)","v":""},{"$f":"IF([1]Sheet1!L27=\"\",\"\",[1]Sheet1!L27)","v":50.82}]
[{"$f":"IF([1]Sheet1!A28=\"\",\"\",[1]Sheet1!A28)","v":"2012-09-30"},{"$f":"IF([1]Sheet1!B28=\"\",\"\",[1]Sheet1!B28)","v":"10:21"},{"$f":"IF([1]Sheet1!C28=\"\",\"\",[1]Sheet1!C28)","v":1},{"$f":"IF([1]Sheet1!D28=\"\",\"\",[1]Sheet1!D28)","v":"007"},1,"007",{"$f":"IF([1]Sheet1!G28=\"\",\"\",[1]Sheet1!G28)","v":""},{"$f":"IF([1]Sheet1!H28=\"\",\"\",[1]Sheet1!H28)","v":14240},{"$f":"IF([1]Sheet1!I28=\"\",\"\",[1]Sheet1!I28)","v":"LINDE 02"},{"$f":"IF([1]Sheet1!J28=\"\",\"\",[1]Sheet1!J28)","v":""},{"$f":"IF([1]Sheet1!K28=\"\",\"\",[1]Sheet1!K28)","v":""},{"$f":"IF([1]Sheet1!L28=\"\",\"\",[1]Sheet1!L28)","v":48.88}]
[{"$f":"IF([1]Sheet1!A29=\"\",\"\",[1]Sheet1!A29)","v":"2012-10-01"},{"$f":"IF([1]Sheet1!B29=\"\",\"\",[1]Sheet1!B29)","v":"18:54"},{"$f":"IF([1]Sheet1!C29=\"\",\"\",[1]Sheet1!C29)","v":1},{"$f":"IF([1]Sheet1!D29=\"\",\"\",[1]Sheet1!D29)","v":"005"},1,"005",{"$f":"IF([1]Sheet1!G29=\"\",\"\",[1]Sheet1!G29)","v":""},{"$f":"IF([1]Sheet1!H29=\"\",\"\",[1]Sheet1!H29)","v":14253},{"$f":"IF([1]Sheet1!I29=\"\",\"\",[1]Sheet1!I29)","v":"LINDE 02"},{"$f":"IF([1]Sheet1!J29=\"\",\"\",[1]Sheet1!J29)","v":""},{"$f":"IF([1]Sheet1!K29=\"\",\"\",[1]Sheet1!K29)","v":""},{"$f":"IF([1]Sheet1!L29=\"\",\"\",[1]Sheet1!L29)","v":33.94}]
[{"$f":"IF([1]Sheet1!A30=\"\",\"\",[1]Sheet1!A30)","v":"2012-10-01"},{"$f":"IF([1]Sheet1!B30=\"\",\"\",[1]Sheet1!B30)","v":"18:56"},{"$f":"IF([1]Sheet1!C30=\"\",\"\",[1]Sheet1!C30)","v":1},{"$f":"IF([1]Sheet1!D30=\"\",\"\",[1]Sheet1!D30)","v":"001"},1,"001",{"$f":"IF([1]Sheet1!G30=\"\",\"\",[1]Sheet1!G30)","v":""},{"$f":"IF([1]Sheet1!H30=\"\",\"\",[1]Sheet1!H30)","v":13455},{"$f":"IF([1]Sheet1!I30=\"\",\"\",[1]Sheet1!I30)","v":"LINDE 01"},{"$f":"IF([1]Sheet1!J30=\"\",\"\",[1]Sheet1!J30)","v":""},{"$f":"IF([1]Sheet1!K30=\"\",\"\",[1]Sheet1!K30)","v":""},{"$f":"IF([1]Sheet1!L30=\"\",\"\",[1]Sheet1!L30)","v":48.04}]
[{"$f":"IF([1]Sheet1!A31=\"\",\"\",[1]Sheet1!A31)","v":"2012-10-02"},{"$f":"IF([1]Sheet1!B31=\"\",\"\",[1]Sheet1!B31)","v":"11:05"},{"$f":"IF([1]Sheet1!C31=\"\",\"\",[1]Sheet1!C31)","v":1},{"$f":"IF([1]Sheet1!D31=\"\",\"\",[1]Sheet1!D31)","v":"014"},1,"014",{"$f":"IF([1]Sheet1!G31=\"\",\"\",[1]Sheet1!G31)","v":""},{"$f":"IF([1]Sheet1!H31=\"\",\"\",[1]Sheet1!H31)","v":19448},{"$f":"IF([1]Sheet1!I31=\"\",\"\",[1]Sheet1!I31)","v":"LINDE 03"},{"$f":"IF([1]Sheet1!J31=\"\",\"\",[1]Sheet1!J31)","v":""},{"$f":"IF([1]Sheet1!K31=\"\",\"\",[1]Sheet1!K31)","v":""},{"$f":"IF([1]Sheet1!L31=\"\",\"\",[1]Sheet1!L31)","v":49.92}]
[{"$f":"IF([1]Sheet1!A32=\"\",\"\",[1]Sheet1!A32)","v":"2012-10-02"},{"$f":"IF([1]Sheet1!B32=\"\",\"\",[1]Sheet1!B32)","v":"12:59"},{"$f":"IF([1]Sheet1!C32=\"\",\"\",[1]Sheet1!C32)","v":1},{"$f":"IF([1]Sheet1!D32=\"\",\"\",[1]Sheet1!D32)","v":"8"},0,"008",{"$f":"IF([1]Sheet1!G32=\"\",\"\",[1]Sheet1!G32)","v":""},{"$f":"IF([1]Sheet1!H32=\"\",\"\",[1]Sheet1!H32)","v":14264},{"$f":"IF([1]Sheet1!I32=\"\",\"\",[1]Sheet1!I32)","v":"LINDE 02"},{"$f":"IF([1]Sheet1!J32=\"\",\"\",[1]Sheet1!J32)","v":""},{"$f":"IF([1]Sheet1!K32=\"\",\"\",[1]Sheet1!K32)","v":""},{"$f":"IF([1]Sheet1!L32=\"\",\"\",[1]Sheet1!L32)","v":31.57}]
[{"$f":"IF([1]Sheet1!A33=\"\",\"\",[1]Sheet1!A33)","v":"2012-10-02"},{"$f":"IF([1]Sheet1!B33=\"\",\"\",[1]Sheet1!B33)","v":"13:02"},{"$f":"IF([1]Sheet1!C33=\"\",\"\",[1]Sheet1!C33)","v":1},{"$f":"IF([1]Sheet1!D33=\"\",\"\",[1]Sheet1!D33)","v":"4"},0,"004",{"$f":"IF([1]Sheet1!G33=\"\",\"\",[1]Sheet1!G33)","v":""},{"$f":"IF([1]Sheet1!H33=\"\",\"\",[1]Sheet1!H33)","v":13463},{"$f":"IF([1]Sheet1!I33=\"\",\"\",[1]Sheet1!I33)","v":"LINDE 01"},{"$f":"IF([1]Sheet1!J33=\"\",\"\",[1]Sheet1!J33)","v":""},{"$f":"IF([1]Sheet1!K33=\"\",\"\",[1]Sheet1!K33)","v":""},{"$f":"IF([1]Sheet1!L33=\"\",\"\",[1]Sheet1!L33)","v":23.7}]
[{"$f":"IF([1]Sheet1!A34=\"\",\"\",[1]Sheet1!A34)","v":"2012-10-03"},{"$f":"IF([1]Sheet1!B34=\"\",\"\",[1]Sheet1!B34)","v":"13:08"},{"$f":"IF([1]Sheet1!C34=\"\",\"\",[1]Sheet1!C34)","v":1},{"$f":"IF([1]Sheet1!D34=\"\",\"\",[1]Sheet1!D34)","v":"8"},0,"008",{"$f":"IF([1]Sheet1!G34=\"\",\"\",[1]Sheet1!G34)","v":""},{"$f":"IF([1]Sheet1!H34=\"\",\"\",[1]Sheet1!H34)","v":14279},{"$f":"IF([1]Sheet1!I34=\"\",\"\",[1]Sheet1!I34)","v":"LINDE 02"},{"$f":"IF([1]Sheet1!J34=\"\",\"\",[1]Sheet1!J34)","v":""},{"$f":"IF([1]Sheet1!K34=\"\",\"\",[1]Sheet1!K34)","v":""},{"$f":"IF([1]Sheet1!L34=\"\",\"\",[1]Sheet1!L34)","v":41.4}]
[{"$f":"IF([1]Sheet1!A35=\"\",\"\",[1]Sheet1!A35)","v":"2012-10-03"},{"$f":"IF([1]Sheet1!B35=\"\",\"\",[1]Sheet1!B35)","v":"13:15"},{"$f":"IF([1]Sheet1!C35=\"\",\"\",[1]Sheet1!C35)","v":1},{"$f":"IF([1]Sheet1!D35=\"\",\"\",[1]Sheet1!D35)","v":"4"},0,"004",{"$f":"IF([1]Sheet1!G35=\"\",\"\",[1]Sheet1!G35)","v":""},{"$f":"IF([1]Sheet1!H35=\"\",\"\",[1]Sheet1!H35)","v":13475},{"$f":"IF([1]Sheet1!I35=\"\",\"\",[1]Sheet1!I35)","v":"LINDE 01"},{"$f":"IF([1]Sheet1!J35=\"\",\"\",[1]Sheet1!J35)","v":""},{"$f":"IF([1]Sheet1!K35=\"\",\"\",[1]Sheet1!K35)","v":""},{"$f":"IF([1]Sheet1!L35=\"\",\"\",[1]Sheet1!L35)","v":34.78}]
[{"$f":"IF([1]Sheet1!A36=\"\",\"\",[1]Sheet1!A36)","v":"2012-10-04"},{"$f":"IF([1]Sheet1!B36=\"\",\"\",[1]Sheet1!B36)","v":"00:46"},{"$f":"IF([1]Sheet1!C36=\"\",\"\",[1]Sheet1!C36)","v":1},{"$f":"IF([1]Sheet1!D36=\"\",\"\",[1]Sheet1!D36)","v":"017"},1,"017",{"$f":"IF([1]Sheet1!G36=\"\",\"\",[1]Sheet1!G36)","v":""},{"$f":"IF([1]Sheet1!H36=\"\",\"\",[1]Sheet1!H36)","v":19470},{"$f":"IF([1]Sheet1!I36=\"\",\"\",[1]Sheet1!I36)","v":"LINDE 03"},{"$f":"IF([1]Sheet1!J36=\"\",\"\",[1]Sheet1!J36)","v":""},{"$f":"IF([1]Sheet1!K36=\"\",\"\",[1]Sheet1!K36)","v":""},{"$f":"IF([1]Sheet1!L36=\"\",\"\",[1]Sheet1!L36)","v":46.910000000000004}]
[{"$f":"IF([1]Sheet1!A37=\"\",\"\",[1]Sheet1!A37)","v":"2012-10-04"},{"$f":"IF([1]Sheet1!B37=\"\",\"\",[1]Sheet1!B37)","v":"13:06"},{"$f":"IF([1]Sheet1!C37=\"\",\"\",[1]Sheet1!C37)","v":1},{"$f":"IF([1]Sheet1!D37=\"\",\"\",[1]Sheet1!D37)","v":"8"},0,"008",{"$f":"IF([1]Sheet1!G37=\"\",\"\",[1]Sheet1!G37)","v":""},{"$f":"IF([1]Sheet1!H37=\"\",\"\",[1]Sheet1!H37)","v":14295},{"$f":"IF([1]Sheet1!I37=\"\",\"\",[1]Sheet1!I37)","v":"LINDE 02"},{"$f":"IF([1]Sheet1!J37=\"\",\"\",[1]Sheet1!J37)","v":""},{"$f":"IF([1]Sheet1!K37=\"\",\"\",[1]Sheet1!K37)","v":""},{"$f":"IF([1]Sheet1!L37=\"\",\"\",[1]Sheet1!L37)","v":46.32}]
[{"$f":"IF([1]Sheet1!A38=\"\",\"\",[1]Sheet1!A38)","v":"2012-10-04"},{"$f":"IF([1]Sheet1!B38=\"\",\"\",[1]Sheet1!B38)","v":"13:21"},{"$f":"IF([1]Sheet1!C38=\"\",\"\",[1]Sheet1!C38)","v":1},{"$f":"IF([1]Sheet1!D38=\"\",\"\",[1]Sheet1!D38)","v":"4"},0,"004",{"$f":"IF([1]Sheet1!G38=\"\",\"\",[1]Sheet1!G38)","v":""},{"$f":"IF([1]Sheet1!H38=\"\",\"\",[1]Sheet1!H38)","v":13493},{"$f":"IF([1]Sheet1!I38=\"\",\"\",[1]Sheet1!I38)","v":"LINDE 01"},{"$f":"IF([1]Sheet1!J38=\"\",\"\",[1]Sheet1!J38)","v":""},{"$f":"IF([1]Sheet1!K38=\"\",\"\",[1]Sheet1!K38)","v":""},{"$f":"IF([1]Sheet1!L38=\"\",\"\",[1]Sheet1!L38)","v":49.26}]
[{"$f":"IF([1]Sheet1!A39=\"\",\"\",[1]Sheet1!A39)","v":"2012-10-05"},{"$f":"IF([1]Sheet1!B39=\"\",\"\",[1]Sheet1!B39)","v":"11:03"},{"$f":"IF([1]Sheet1!C39=\"\",\"\",[1]Sheet1!C39)","v":1},{"$f":"IF([1]Sheet1!D39=\"\",\"\",[1]Sheet1!D39)","v":"202"},1,"202",{"$f":"IF([1]Sheet1!G39=\"\",\"\",[1]Sheet1!G39)","v":""},{"$f":"IF([1]Sheet1!H39=\"\",\"\",[1]Sheet1!H39)","v":44398},{"$f":"IF([1]Sheet1!I39=\"\",\"\",[1]Sheet1!I39)","v":"SMP"},{"$f":"IF([1]Sheet1!J39=\"\",\"\",[1]Sheet1!J39)","v":""},{"$f":"IF([1]Sheet1!K39=\"\",\"\",[1]Sheet1!K39)","v":""},{"$f":"IF([1]Sheet1!L39=\"\",\"\",[1]Sheet1!L39)","v":50.69}]
[{"$f":"IF([1]Sheet1!A40=\"\",\"\",[1]Sheet1!A40)","v":"2012-10-05"},{"$f":"IF([1]Sheet1!B40=\"\",\"\",[1]Sheet1!B40)","v":"11:09"},{"$f":"IF([1]Sheet1!C40=\"\",\"\",[1]Sheet1!C40)","v":1},{"$f":"IF([1]Sheet1!D40=\"\",\"\",[1]Sheet1!D40)","v":"016"},1,"016",{"$f":"IF([1]Sheet1!G40=\"\",\"\",[1]Sheet1!G40)","v":""},{"$f":"IF([1]Sheet1!H40=\"\",\"\",[1]Sheet1!H40)","v":19493},{"$f":"IF([1]Sheet1!I40=\"\",\"\",[1]Sheet1!I40)","v":"LINDE 03"},{"$f":"IF([1]Sheet1!J40=\"\",\"\",[1]Sheet1!J40)","v":""},{"$f":"IF([1]Sheet1!K40=\"\",\"\",[1]Sheet1!K40)","v":""},{"$f":"IF([1]Sheet1!L40=\"\",\"\",[1]Sheet1!L40)","v":38.59}]
[{"$f":"IF([1]Sheet1!A41=\"\",\"\",[1]Sheet1!A41)","v":"2012-10-05"},{"$f":"IF([1]Sheet1!B41=\"\",\"\",[1]Sheet1!B41)","v":"13:04"},{"$f":"IF([1]Sheet1!C41=\"\",\"\",[1]Sheet1!C41)","v":1},{"$f":"IF([1]Sheet1!D41=\"\",\"\",[1]Sheet1!D41)","v":"006"},1,"006",{"$f":"IF([1]Sheet1!G41=\"\",\"\",[1]Sheet1!G41)","v":""},{"$f":"IF([1]Sheet1!H41=\"\",\"\",[1]Sheet1!H41)","v":14312},{"$f":"IF([1]Sheet1!I41=\"\",\"\",[1]Sheet1!I41)","v":"LINDE 02"},{"$f":"IF([1]Sheet1!J41=\"\",\"\",[1]Sheet1!J41)","v":""},{"$f":"IF([1]Sheet1!K41=\"\",\"\",[1]Sheet1!K41)","v":""},{"$f":"IF([1]Sheet1!L41=\"\",\"\",[1]Sheet1!L41)","v":45.06}]
[{"$f":"IF([1]Sheet1!A42=\"\",\"\",[1]Sheet1!A42)","v":"2012-10-05"},{"$f":"IF([1]Sheet1!B42=\"\",\"\",[1]Sheet1!B42)","v":"13:07"},{"$f":"IF([1]Sheet1!C42=\"\",\"\",[1]Sheet1!C42)","v":1},{"$f":"IF([1]Sheet1!D42=\"\",\"\",[1]Sheet1!D42)","v":"002"},1,"002",{"$f":"IF([1]Sheet1!G42=\"\",\"\",[1]Sheet1!G42)","v":""},{"$f":"IF([1]Sheet1!H42=\"\",\"\",[1]Sheet1!H42)","v":13509},{"$f":"IF([1]Sheet1!I42=\"\",\"\",[1]Sheet1!I42)","v":"LINDE 01"},{"$f":"IF([1]Sheet1!J42=\"\",\"\",[1]Sheet1!J42)","v":""},{"$f":"IF([1]Sheet1!K42=\"\",\"\",[1]Sheet1!K42)","v":""},{"$f":"IF([1]Sheet1!L42=\"\",\"\",[1]Sheet1!L42)","v":45.18}]
[{"$f":"IF([1]Sheet1!A43=\"\",\"\",[1]Sheet1!A43)","v":"2012-10-06"},{"$f":"IF([1]Sheet1!B43=\"\",\"\",[1]Sheet1!B43)","v":"12:42"},{"$f":"IF([1]Sheet1!C43=\"\",\"\",[1]Sheet1!C43)","v":1},{"$f":"IF([1]Sheet1!D43=\"\",\"\",[1]Sheet1!D43)","v":"006"},1,"006",{"$f":"IF([1]Sheet1!G43=\"\",\"\",[1]Sheet1!G43)","v":""},{"$f":"IF([1]Sheet1!H43=\"\",\"\",[1]Sheet1!H43)","v":14326},{"$f":"IF([1]Sheet1!I43=\"\",\"\",[1]Sheet1!I43)","v":"LINDE 02"},{"$f":"IF([1]Sheet1!J43=\"\",\"\",[1]Sheet1!J43)","v":""},{"$f":"IF([1]Sheet1!K43=\"\",\"\",[1]Sheet1!K43)","v":""},{"$f":"IF([1]Sheet1!L43=\"\",\"\",[1]Sheet1!L43)","v":35.08}]
[{"$f":"IF([1]Sheet1!A44=\"\",\"\",[1]Sheet1!A44)","v":"2012-10-06"},{"$f":"IF([1]Sheet1!B44=\"\",\"\",[1]Sheet1!B44)","v":"12:58"},{"$f":"IF([1]Sheet1!C44=\"\",\"\",[1]Sheet1!C44)","v":1},{"$f":"IF([1]Sheet1!D44=\"\",\"\",[1]Sheet1!D44)","v":"002"},1,"002",{"$f":"IF([1]Sheet1!G44=\"\",\"\",[1]Sheet1!G44)","v":""},{"$f":"IF([1]Sheet1!H44=\"\",\"\",[1]Sheet1!H44)","v":13523},{"$f":"IF([1]Sheet1!I44=\"\",\"\",[1]Sheet1!I44)","v":"LINDE 01"},{"$f":"IF([1]Sheet1!J44=\"\",\"\",[1]Sheet1!J44)","v":""},{"$f":"IF([1]Sheet1!K44=\"\",\"\",[1]Sheet1!K44)","v":""},{"$f":"IF([1]Sheet1!L44=\"\",\"\",[1]Sheet1!L44)","v":35.3}]
[{"$f":"IF([1]Sheet1!A45=\"\",\"\",[1]Sheet1!A45)","v":"2012-10-07"},{"$f":"IF([1]Sheet1!B45=\"\",\"\",[1]Sheet1!B45)","v":"12:36"},{"$f":"IF([1]Sheet1!C45=\"\",\"\",[1]Sheet1!C45)","v":1},{"$f":"IF([1]Sheet1!D45=\"\",\"\",[1]Sheet1!D45)","v":"016"},1,"016",{"$f":"IF([1]Sheet1!G45=\"\",\"\",[1]Sheet1!G45)","v":""},{"$f":"IF([1]Sheet1!H45=\"\",\"\",[1]Sheet1!H45)","v":19511},{"$f":"IF([1]Sheet1!I45=\"\",\"\",[1]Sheet1!I45)","v":"LINDE 03"},{"$f":"IF([1]Sheet1!J45=\"\",\"\",[1]Sheet1!J45)","v":""},{"$f":"IF([1]Sheet1!K45=\"\",\"\",[1]Sheet1!K45)","v":""},{"$f":"IF([1]Sheet1!L45=\"\",\"\",[1]Sheet1!L45)","v":35.39}]
[{"$f":"IF([1]Sheet1!A46=\"\",\"\",[1]Sheet1!A46)","v":"2012-10-08"},{"$f":"IF([1]Sheet1!B46=\"\",\"\",[1]Sheet1!B46)","v":"13:17"},{"$f":"IF([1]Sheet1!C46=\"\",\"\",[1]Sheet1!C46)","v":1},{"$f":"IF([1]Sheet1!D46=\"\",\"\",[1]Sheet1!D46)","v":"006"},1,"006",{"$f":"IF([1]Sheet1!G46=\"\",\"\",[1]Sheet1!G46)","v":""},{"$f":"IF([1]Sheet1!H46=\"\",\"\",[1]Sheet1!H46)","v":14345},{"$f":"IF([1]Sheet1!I46=\"\",\"\",[1]Sheet1!I46)","v":"LINDE 02"},{"$f":"IF([1]Sheet1!J46=\"\",\"\",[1]Sheet1!J46)","v":""},{"$f":"IF([1]Sheet1!K46=\"\",\"\",[1]Sheet1!K46)","v":""},{"$f":"IF([1]Sheet1!L46=\"\",\"\",[1]Sheet1!L46)","v":45.22}]
[{"$f":"IF([1]Sheet1!A47=\"\",\"\",[1]Sheet1!A47)","v":"2012-10-08"},{"$f":"IF([1]Sheet1!B47=\"\",\"\",[1]Sheet1!B47)","v":"13:19"},{"$f":"IF([1]Sheet1!C47=\"\",\"\",[1]Sheet1!C47)","v":1},{"$f":"IF([1]Sheet1!D47=\"\",\"\",[1]Sheet1!D47)","v":"002"},1,"002",{"$f":"IF([1]Sheet1!G47=\"\",\"\",[1]Sheet1!G47)","v":""},{"$f":"IF([1]Sheet1!H47=\"\",\"\",[1]Sheet1!H47)","v":13532},{"$f":"IF([1]Sheet1!I47=\"\",\"\",[1]Sheet1!I47)","v":"LINDE 01"},{"$f":"IF([1]Sheet1!J47=\"\",\"\",[1]Sheet1!J47)","v":""},{"$f":"IF([1]Sheet1!K47=\"\",\"\",[1]Sheet1!K47)","v":""},{"$f":"IF([1]Sheet1!L47=\"\",\"\",[1]Sheet1!L47)","v":23.29}]
[{"$f":"IF([1]Sheet1!A48=\"\",\"\",[1]Sheet1!A48)","v":"2012-10-09"},{"$f":"IF([1]Sheet1!B48=\"\",\"\",[1]Sheet1!B48)","v":"11:30"},{"$f":"IF([1]Sheet1!C48=\"\",\"\",[1]Sheet1!C48)","v":1},{"$f":"IF([1]Sheet1!D48=\"\",\"\",[1]Sheet1!D48)","v":"005"},1,"005",{"$f":"IF([1]Sheet1!G48=\"\",\"\",[1]Sheet1!G48)","v":""},{"$f":"IF([1]Sheet1!H48=\"\",\"\",[1]Sheet1!H48)","v":14363},{"$f":"IF([1]Sheet1!I48=\"\",\"\",[1]Sheet1!I48)","v":"LINDE 02"},{"$f":"IF([1]Sheet1!J48=\"\",\"\",[1]Sheet1!J48)","v":""},{"$f":"IF([1]Sheet1!K48=\"\",\"\",[1]Sheet1!K48)","v":""},{"$f":"IF([1]Sheet1!L48=\"\",\"\",[1]Sheet1!L48)","v":45.43}]
[{"$f":"IF([1]Sheet1!A49=\"\",\"\",[1]Sheet1!A49)","v":"2012-10-09"},{"$f":"IF([1]Sheet1!B49=\"\",\"\",[1]Sheet1!B49)","v":"11:33"},{"$f":"IF([1]Sheet1!C49=\"\",\"\",[1]Sheet1!C49)","v":1},{"$f":"IF([1]Sheet1!D49=\"\",\"\",[1]Sheet1!D49)","v":"001"},1,"001",{"$f":"IF([1]Sheet1!G49=\"\",\"\",[1]Sheet1!G49)","v":""},{"$f":"IF([1]Sheet1!H49=\"\",\"\",[1]Sheet1!H49)","v":13550},{"$f":"IF([1]Sheet1!I49=\"\",\"\",[1]Sheet1!I49)","v":"LINDE 01"},{"$f":"IF([1]Sheet1!J49=\"\",\"\",[1]Sheet1!J49)","v":""},{"$f":"IF([1]Sheet1!K49=\"\",\"\",[1]Sheet1!K49)","v":""},{"$f":"IF([1]Sheet1!L49=\"\",\"\",[1]Sheet1!L49)","v":45.86}]
[{"$f":"IF([1]Sheet1!A50=\"\",\"\",[1]Sheet1!A50)","v":"2012-10-09"},{"$f":"IF([1]Sheet1!B50=\"\",\"\",[1]Sheet1!B50)","v":"22:19"},{"$f":"IF([1]Sheet1!C50=\"\",\"\",[1]Sheet1!C50)","v":1},{"$f":"IF([1]Sheet1!D50=\"\",\"\",[1]Sheet1!D50)","v":"013"},1,"013",{"$f":"IF([1]Sheet1!G50=\"\",\"\",[1]Sheet1!G50)","v":""},{"$f":"IF([1]Sheet1!H50=\"\",\"\",[1]Sheet1!H50)","v":19538},{"$f":"IF([1]Sheet1!I50=\"\",\"\",[1]Sheet1!I50)","v":"LINDE 03"},{"$f":"IF([1]Sheet1!J50=\"\",\"\",[1]Sheet1!J50)","v":""},{"$f":"IF([1]Sheet1!K50=\"\",\"\",[1]Sheet1!K50)","v":""},{"$f":"IF([1]Sheet1!L50=\"\",\"\",[1]Sheet1!L50)","v":53.11}]
[{"$f":"IF([1]Sheet1!A51=\"\",\"\",[1]Sheet1!A51)","v":"2012-10-10"},{"$f":"IF([1]Sheet1!B51=\"\",\"\",[1]Sheet1!B51)","v":"07:30"},{"$f":"IF([1]Sheet1!C51=\"\",\"\",[1]Sheet1!C51)","v":1},{"$f":"IF([1]Sheet1!D51=\"\",\"\",[1]Sheet1!D51)","v":"201"},1,"201",{"$f":"IF([1]Sheet1!G51=\"\",\"\",[1]Sheet1!G51)","v":""},{"$f":"IF([1]Sheet1!H51=\"\",\"\",[1]Sheet1!H51)","v":28987},{"$f":"IF([1]Sheet1!I51=\"\",\"\",[1]Sheet1!I51)","v":"SMP"},{"$f":"IF([1]Sheet1!J51=\"\",\"\",[1]Sheet1!J51)","v":""},{"$f":"IF([1]Sheet1!K51=\"\",\"\",[1]Sheet1!K51)","v":""},{"$f":"IF([1]Sheet1!L51=\"\",\"\",[1]Sheet1!L51)","v":45.12}]
[{"$f":"IF([1]Sheet1!A52=\"\",\"\",[1]Sheet1!A52)","v":"2012-10-10"},{"$f":"IF([1]Sheet1!B52=\"\",\"\",[1]Sheet1!B52)","v":"08:45"},{"$f":"IF([1]Sheet1!C52=\"\",\"\",[1]Sheet1!C52)","v":1},{"$f":"IF([1]Sheet1!D52=\"\",\"\",[1]Sheet1!D52)","v":"001"},1,"001",{"$f":"IF([1]Sheet1!G52=\"\",\"\",[1]Sheet1!G52)","v":""},{"$f":"IF([1]Sheet1!H52=\"\",\"\",[1]Sheet1!H52)","v":13565},{"$f":"IF([1]Sheet1!I52=\"\",\"\",[1]Sheet1!I52)","v":"LINDE 01"},{"$f":"IF([1]Sheet1!J52=\"\",\"\",[1]Sheet1!J52)","v":""},{"$f":"IF([1]Sheet1!K52=\"\",\"\",[1]Sheet1!K52)","v":""},{"$f":"IF([1]Sheet1!L52=\"\",\"\",[1]Sheet1!L52)","v":45.59}]
[{"$f":"IF([1]Sheet1!A53=\"\",\"\",[1]Sheet1!A53)","v":"2012-10-10"},{"$f":"IF([1]Sheet1!B53=\"\",\"\",[1]Sheet1!B53)","v":"08:48"},{"$f":"IF([1]Sheet1!C53=\"\",\"\",[1]Sheet1!C53)","v":1},{"$f":"IF([1]Sheet1!D53=\"\",\"\",[1]Sheet1!D53)","v":"005"},1,"005",{"$f":"IF([1]Sheet1!G53=\"\",\"\",[1]Sheet1!G53)","v":""},{"$f":"IF([1]Sheet1!H53=\"\",\"\",[1]Sheet1!H53)","v":14379},{"$f":"IF([1]Sheet1!I53=\"\",\"\",[1]Sheet1!I53)","v":"LINDE 02"},{"$f":"IF([1]Sheet1!J53=\"\",\"\",[1]Sheet1!J53)","v":""},{"$f":"IF([1]Sheet1!K53=\"\",\"\",[1]Sheet1!K53)","v":""},{"$f":"IF([1]Sheet1!L53=\"\",\"\",[1]Sheet1!L53)","v":46.58}]
[{"$f":"IF([1]Sheet1!A54=\"\",\"\",[1]Sheet1!A54)","v":"2012-10-11"},{"$f":"IF([1]Sheet1!B54=\"\",\"\",[1]Sheet1!B54)","v":"10:23"},{"$f":"IF([1]Sheet1!C54=\"\",\"\",[1]Sheet1!C54)","v":1},{"$f":"IF([1]Sheet1!D54=\"\",\"\",[1]Sheet1!D54)","v":"001"},1,"001",{"$f":"IF([1]Sheet1!G54=\"\",\"\",[1]Sheet1!G54)","v":""},{"$f":"IF([1]Sheet1!H54=\"\",\"\",[1]Sheet1!H54)","v":13584},{"$f":"IF([1]Sheet1!I54=\"\",\"\",[1]Sheet1!I54)","v":"LINDE 01"},{"$f":"IF([1]Sheet1!J54=\"\",\"\",[1]Sheet1!J54)","v":""},{"$f":"IF([1]Sheet1!K54=\"\",\"\",[1]Sheet1!K54)","v":""},{"$f":"IF([1]Sheet1!L54=\"\",\"\",[1]Sheet1!L54)","v":44.96}]
[{"$f":"IF([1]Sheet1!A55=\"\",\"\",[1]Sheet1!A55)","v":"2012-10-11"},{"$f":"IF([1]Sheet1!B55=\"\",\"\",[1]Sheet1!B55)","v":"10:26"},{"$f":"IF([1]Sheet1!C55=\"\",\"\",[1]Sheet1!C55)","v":1},{"$f":"IF([1]Sheet1!D55=\"\",\"\",[1]Sheet1!D55)","v":"005"},1,"005",{"$f":"IF([1]Sheet1!G55=\"\",\"\",[1]Sheet1!G55)","v":""},{"$f":"IF([1]Sheet1!H55=\"\",\"\",[1]Sheet1!H55)","v":14397},{"$f":"IF([1]Sheet1!I55=\"\",\"\",[1]Sheet1!I55)","v":"LINDE 02"},{"$f":"IF([1]Sheet1!J55=\"\",\"\",[1]Sheet1!J55)","v":""},{"$f":"IF([1]Sheet1!K55=\"\",\"\",[1]Sheet1!K55)","v":""},{"$f":"IF([1]Sheet1!L55=\"\",\"\",[1]Sheet1!L55)","v":50.18}]
[{"$f":"IF([1]Sheet1!A56=\"\",\"\",[1]Sheet1!A56)","v":"2012-10-11"},{"$f":"IF([1]Sheet1!B56=\"\",\"\",[1]Sheet1!B56)","v":"17:07"},{"$f":"IF([1]Sheet1!C56=\"\",\"\",[1]Sheet1!C56)","v":1},{"$f":"IF([1]Sheet1!D56=\"\",\"\",[1]Sheet1!D56)","v":"016"},1,"016",{"$f":"IF([1]Sheet1!G56=\"\",\"\",[1]Sheet1!G56)","v":""},{"$f":"IF([1]Sheet1!H56=\"\",\"\",[1]Sheet1!H56)","v":19559},{"$f":"IF([1]Sheet1!I56=\"\",\"\",[1]Sheet1!I56)","v":"LINDE 03"},{"$f":"IF([1]Sheet1!J56=\"\",\"\",[1]Sheet1!J56)","v":""},{"$f":"IF([1]Sheet1!K56=\"\",\"\",[1]Sheet1!K56)","v":""},{"$f":"IF([1]Sheet1!L56=\"\",\"\",[1]Sheet1!L56)","v":46.050000000000004}]
[{"$f":"IF([1]Sheet1!A57=\"\",\"\",[1]Sheet1!A57)","v":"2012-10-12"},{"$f":"IF([1]Sheet1!B57=\"\",\"\",[1]Sheet1!B57)","v":"05:18"},{"$f":"IF([1]Sheet1!C57=\"\",\"\",[1]Sheet1!C57)","v":1},{"$f":"IF([1]Sheet1!D57=\"\",\"\",[1]Sheet1!D57)","v":"008"},1,"008",{"$f":"IF([1]Sheet1!G57=\"\",\"\",[1]Sheet1!G57)","v":""},{"$f":"IF([1]Sheet1!H57=\"\",\"\",[1]Sheet1!H57)","v":14412},{"$f":"IF([1]Sheet1!I57=\"\",\"\",[1]Sheet1!I57)","v":"LINDE 02"},{"$f":"IF([1]Sheet1!J57=\"\",\"\",[1]Sheet1!J57)","v":""},{"$f":"IF([1]Sheet1!K57=\"\",\"\",[1]Sheet1!K57)","v":""},{"$f":"IF([1]Sheet1!L57=\"\",\"\",[1]Sheet1!L57)","v":38.91}]
[{"$f":"IF([1]Sheet1!A58=\"\",\"\",[1]Sheet1!A58)","v":"2012-10-12"},{"$f":"IF([1]Sheet1!B58=\"\",\"\",[1]Sheet1!B58)","v":"11:27"},{"$f":"IF([1]Sheet1!C58=\"\",\"\",[1]Sheet1!C58)","v":1},{"$f":"IF([1]Sheet1!D58=\"\",\"\",[1]Sheet1!D58)","v":"001"},1,"001",{"$f":"IF([1]Sheet1!G58=\"\",\"\",[1]Sheet1!G58)","v":""},{"$f":"IF([1]Sheet1!H58=\"\",\"\",[1]Sheet1!H58)","v":13599},{"$f":"IF([1]Sheet1!I58=\"\",\"\",[1]Sheet1!I58)","v":"LINDE 01"},{"$f":"IF([1]Sheet1!J58=\"\",\"\",[1]Sheet1!J58)","v":""},{"$f":"IF([1]Sheet1!K58=\"\",\"\",[1]Sheet1!K58)","v":""},{"$f":"IF([1]Sheet1!L58=\"\",\"\",[1]Sheet1!L58)","v":39.89}]
[{"$f":"IF([1]Sheet1!A59=\"\",\"\",[1]Sheet1!A59)","v":"2012-10-12"},{"$f":"IF([1]Sheet1!B59=\"\",\"\",[1]Sheet1!B59)","v":"12:59"},{"$f":"IF([1]Sheet1!C59=\"\",\"\",[1]Sheet1!C59)","v":1},{"$f":"IF([1]Sheet1!D59=\"\",\"\",[1]Sheet1!D59)","v":"005"},1,"005",{"$f":"IF([1]Sheet1!G59=\"\",\"\",[1]Sheet1!G59)","v":""},{"$f":"IF([1]Sheet1!H59=\"\",\"\",[1]Sheet1!H59)","v":14418},{"$f":"IF([1]Sheet1!I59=\"\",\"\",[1]Sheet1!I59)","v":"LINDE 02"},{"$f":"IF([1]Sheet1!J59=\"\",\"\",[1]Sheet1!J59)","v":""},{"$f":"IF([1]Sheet1!K59=\"\",\"\",[1]Sheet1!K59)","v":""},{"$f":"IF([1]Sheet1!L59=\"\",\"\",[1]Sheet1!L59)","v":12.97}]
[{"$f":"IF([1]Sheet1!A60=\"\",\"\",[1]Sheet1!A60)","v":"2012-10-13"},{"$f":"IF([1]Sheet1!B60=\"\",\"\",[1]Sheet1!B60)","v":"11:18"},{"$f":"IF([1]Sheet1!C60=\"\",\"\",[1]Sheet1!C60)","v":1},{"$f":"IF([1]Sheet1!D60=\"\",\"\",[1]Sheet1!D60)","v":"007"},1,"007",{"$f":"IF([1]Sheet1!G60=\"\",\"\",[1]Sheet1!G60)","v":""},{"$f":"IF([1]Sheet1!H60=\"\",\"\",[1]Sheet1!H60)","v":14436},{"$f":"IF([1]Sheet1!I60=\"\",\"\",[1]Sheet1!I60)","v":"LINDE 02"},{"$f":"IF([1]Sheet1!J60=\"\",\"\",[1]Sheet1!J60)","v":""},{"$f":"IF([1]Sheet1!K60=\"\",\"\",[1]Sheet1!K60)","v":""},{"$f":"IF([1]Sheet1!L60=\"\",\"\",[1]Sheet1!L60)","v":46.78}]
[{"$f":"IF([1]Sheet1!A61=\"\",\"\",[1]Sheet1!A61)","v":"2012-10-14"},{"$f":"IF([1]Sheet1!B61=\"\",\"\",[1]Sheet1!B61)","v":"10:31"},{"$f":"IF([1]Sheet1!C61=\"\",\"\",[1]Sheet1!C61)","v":1},{"$f":"IF([1]Sheet1!D61=\"\",\"\",[1]Sheet1!D61)","v":"003"},1,"003",{"$f":"IF([1]Sheet1!G61=\"\",\"\",[1]Sheet1!G61)","v":""},{"$f":"IF([1]Sheet1!H61=\"\",\"\",[1]Sheet1!H61)","v":13618},{"$f":"IF([1]Sheet1!I61=\"\",\"\",[1]Sheet1!I61)","v":"LINDE 01"},{"$f":"IF([1]Sheet1!J61=\"\",\"\",[1]Sheet1!J61)","v":""},{"$f":"IF([1]Sheet1!K61=\"\",\"\",[1]Sheet1!K61)","v":""},{"$f":"IF([1]Sheet1!L61=\"\",\"\",[1]Sheet1!L61)","v":48.27}]
[{"$f":"IF([1]Sheet1!A62=\"\",\"\",[1]Sheet1!A62)","v":"2012-10-15"},{"$f":"IF([1]Sheet1!B62=\"\",\"\",[1]Sheet1!B62)","v":"07:33"},{"$f":"IF([1]Sheet1!C62=\"\",\"\",[1]Sheet1!C62)","v":1},{"$f":"IF([1]Sheet1!D62=\"\",\"\",[1]Sheet1!D62)","v":"106"},1,"106",{"$f":"IF([1]Sheet1!G62=\"\",\"\",[1]Sheet1!G62)","v":""},{"$f":"IF([1]Sheet1!H62=\"\",\"\",[1]Sheet1!H62)","v":49019},{"$f":"IF([1]Sheet1!I62=\"\",\"\",[1]Sheet1!I62)","v":"SUR"},{"$f":"IF([1]Sheet1!J62=\"\",\"\",[1]Sheet1!J62)","v":""},{"$f":"IF([1]Sheet1!K62=\"\",\"\",[1]Sheet1!K62)","v":""},{"$f":"IF([1]Sheet1!L62=\"\",\"\",[1]Sheet1!L62)","v":46.14}]
[{"$f":"IF([1]Sheet1!A63=\"\",\"\",[1]Sheet1!A63)","v":"2012-10-15"},{"$f":"IF([1]Sheet1!B63=\"\",\"\",[1]Sheet1!B63)","v":"12:57"},{"$f":"IF([1]Sheet1!C63=\"\",\"\",[1]Sheet1!C63)","v":1},{"$f":"IF([1]Sheet1!D63=\"\",\"\",[1]Sheet1!D63)","v":"007"},1,"007",{"$f":"IF([1]Sheet1!G63=\"\",\"\",[1]Sheet1!G63)","v":""},{"$f":"IF([1]Sheet1!H63=\"\",\"\",[1]Sheet1!H63)","v":14453},{"$f":"IF([1]Sheet1!I63=\"\",\"\",[1]Sheet1!I63)","v":"LINDE 02"},{"$f":"IF([1]Sheet1!J63=\"\",\"\",[1]Sheet1!J63)","v":""},{"$f":"IF([1]Sheet1!K63=\"\",\"\",[1]Sheet1!K63)","v":""},{"$f":"IF([1]Sheet1!L63=\"\",\"\",[1]Sheet1!L63)","v":43.59}]
[{"$f":"IF([1]Sheet1!A64=\"\",\"\",[1]Sheet1!A64)","v":"2012-10-15"},{"$f":"IF([1]Sheet1!B64=\"\",\"\",[1]Sheet1!B64)","v":"13:01"},{"$f":"IF([1]Sheet1!C64=\"\",\"\",[1]Sheet1!C64)","v":1},{"$f":"IF([1]Sheet1!D64=\"\",\"\",[1]Sheet1!D64)","v":"003"},1,"003",{"$f":"IF([1]Sheet1!G64=\"\",\"\",[1]Sheet1!G64)","v":""},{"$f":"IF([1]Sheet1!H64=\"\",\"\",[1]Sheet1!H64)","v":13624},{"$f":"IF([1]Sheet1!I64=\"\",\"\",[1]Sheet1!I64)","v":"LINDE 01"},{"$f":"IF([1]Sheet1!J64=\"\",\"\",[1]Sheet1!J64)","v":""},{"$f":"IF([1]Sheet1!K64=\"\",\"\",[1]Sheet1!K64)","v":""},{"$f":"IF([1]Sheet1!L64=\"\",\"\",[1]Sheet1!L64)","v":22.09}]
[{"$f":"IF([1]Sheet1!A65=\"\",\"\",[1]Sheet1!A65)","v":"2012-10-16"},{"$f":"IF([1]Sheet1!B65=\"\",\"\",[1]Sheet1!B65)","v":"10:51"},{"$f":"IF([1]Sheet1!C65=\"\",\"\",[1]Sheet1!C65)","v":1},{"$f":"IF([1]Sheet1!D65=\"\",\"\",[1]Sheet1!D65)","v":"017"},1,"017",{"$f":"IF([1]Sheet1!G65=\"\",\"\",[1]Sheet1!G65)","v":""},{"$f":"IF([1]Sheet1!H65=\"\",\"\",[1]Sheet1!H65)","v":19580},{"$f":"IF([1]Sheet1!I65=\"\",\"\",[1]Sheet1!I65)","v":"LINDE 03"},{"$f":"IF([1]Sheet1!J65=\"\",\"\",[1]Sheet1!J65)","v":""},{"$f":"IF([1]Sheet1!K65=\"\",\"\",[1]Sheet1!K65)","v":""},{"$f":"IF([1]Sheet1!L65=\"\",\"\",[1]Sheet1!L65)","v":43.96}]
[{"$f":"IF([1]Sheet1!A66=\"\",\"\",[1]Sheet1!A66)","v":"2012-10-16"},{"$f":"IF([1]Sheet1!B66=\"\",\"\",[1]Sheet1!B66)","v":"11:18"},{"$f":"IF([1]Sheet1!C66=\"\",\"\",[1]Sheet1!C66)","v":1},{"$f":"IF([1]Sheet1!D66=\"\",\"\",[1]Sheet1!D66)","v":"003"},1,"003",{"$f":"IF([1]Sheet1!G66=\"\",\"\",[1]Sheet1!G66)","v":""},{"$f":"IF([1]Sheet1!H66=\"\",\"\",[1]Sheet1!H66)","v":13641},{"$f":"IF([1]Sheet1!I66=\"\",\"\",[1]Sheet1!I66)","v":"LINDE 01"},{"$f":"IF([1]Sheet1!J66=\"\",\"\",[1]Sheet1!J66)","v":""},{"$f":"IF([1]Sheet1!K66=\"\",\"\",[1]Sheet1!K66)","v":""},{"$f":"IF([1]Sheet1!L66=\"\",\"\",[1]Sheet1!L66)","v":50.52}]
[{"$f":"IF([1]Sheet1!A67=\"\",\"\",[1]Sheet1!A67)","v":"2012-10-16"},{"$f":"IF([1]Sheet1!B67=\"\",\"\",[1]Sheet1!B67)","v":"19:59"},{"$f":"IF([1]Sheet1!C67=\"\",\"\",[1]Sheet1!C67)","v":1},{"$f":"IF([1]Sheet1!D67=\"\",\"\",[1]Sheet1!D67)","v":"005"},1,"005",{"$f":"IF([1]Sheet1!G67=\"\",\"\",[1]Sheet1!G67)","v":""},{"$f":"IF([1]Sheet1!H67=\"\",\"\",[1]Sheet1!H67)","v":14474},{"$f":"IF([1]Sheet1!I67=\"\",\"\",[1]Sheet1!I67)","v":"LINDE 02"},{"$f":"IF([1]Sheet1!J67=\"\",\"\",[1]Sheet1!J67)","v":""},{"$f":"IF([1]Sheet1!K67=\"\",\"\",[1]Sheet1!K67)","v":""},{"$f":"IF([1]Sheet1!L67=\"\",\"\",[1]Sheet1!L67)","v":52.54}]
[{"$f":"IF([1]Sheet1!A68=\"\",\"\",[1]Sheet1!A68)","v":"2012-10-17"},{"$f":"IF([1]Sheet1!B68=\"\",\"\",[1]Sheet1!B68)","v":"11:08"},{"$f":"IF([1]Sheet1!C68=\"\",\"\",[1]Sheet1!C68)","v":1},{"$f":"IF([1]Sheet1!D68=\"\",\"\",[1]Sheet1!D68)","v":"004"},1,"004",{"$f":"IF([1]Sheet1!G68=\"\",\"\",[1]Sheet1!G68)","v":""},{"$f":"IF([1]Sheet1!H68=\"\",\"\",[1]Sheet1!H68)","v":13661},{"$f":"IF([1]Sheet1!I68=\"\",\"\",[1]Sheet1!I68)","v":"LINDE 01"},{"$f":"IF([1]Sheet1!J68=\"\",\"\",[1]Sheet1!J68)","v":""},{"$f":"IF([1]Sheet1!K68=\"\",\"\",[1]Sheet1!K68)","v":""},{"$f":"IF([1]Sheet1!L68=\"\",\"\",[1]Sheet1!L68)","v":50.39}]
[{"$f":"IF([1]Sheet1!A69=\"\",\"\",[1]Sheet1!A69)","v":"2012-10-17"},{"$f":"IF([1]Sheet1!B69=\"\",\"\",[1]Sheet1!B69)","v":"13:16"},{"$f":"IF([1]Sheet1!C69=\"\",\"\",[1]Sheet1!C69)","v":1},{"$f":"IF([1]Sheet1!D69=\"\",\"\",[1]Sheet1!D69)","v":"008"},1,"008",{"$f":"IF([1]Sheet1!G69=\"\",\"\",[1]Sheet1!G69)","v":""},{"$f":"IF([1]Sheet1!H69=\"\",\"\",[1]Sheet1!H69)","v":14487},{"$f":"IF([1]Sheet1!I69=\"\",\"\",[1]Sheet1!I69)","v":"LINDE 02"},{"$f":"IF([1]Sheet1!J69=\"\",\"\",[1]Sheet1!J69)","v":""},{"$f":"IF([1]Sheet1!K69=\"\",\"\",[1]Sheet1!K69)","v":""},{"$f":"IF([1]Sheet1!L69=\"\",\"\",[1]Sheet1!L69)","v":35.27}]
[{"$f":"IF([1]Sheet1!A70=\"\",\"\",[1]Sheet1!A70)","v":"2012-10-18"},{"$f":"IF([1]Sheet1!B70=\"\",\"\",[1]Sheet1!B70)","v":"11:03"},{"$f":"IF([1]Sheet1!C70=\"\",\"\",[1]Sheet1!C70)","v":1},{"$f":"IF([1]Sheet1!D70=\"\",\"\",[1]Sheet1!D70)","v":"004"},1,"004",{"$f":"IF([1]Sheet1!G70=\"\",\"\",[1]Sheet1!G70)","v":""},{"$f":"IF([1]Sheet1!H70=\"\",\"\",[1]Sheet1!H70)","v":13682},{"$f":"IF([1]Sheet1!I70=\"\",\"\",[1]Sheet1!I70)","v":"LINDE 01"},{"$f":"IF([1]Sheet1!J70=\"\",\"\",[1]Sheet1!J70)","v":""},{"$f":"IF([1]Sheet1!K70=\"\",\"\",[1]Sheet1!K70)","v":""},{"$f":"IF([1]Sheet1!L70=\"\",\"\",[1]Sheet1!L70)","v":52.42}]
[{"$f":"IF([1]Sheet1!A71=\"\",\"\",[1]Sheet1!A71)","v":"2012-10-18"},{"$f":"IF([1]Sheet1!B71=\"\",\"\",[1]Sheet1!B71)","v":"12:57"},{"$f":"IF([1]Sheet1!C71=\"\",\"\",[1]Sheet1!C71)","v":1},{"$f":"IF([1]Sheet1!D71=\"\",\"\",[1]Sheet1!D71)","v":"008"},1,"008",{"$f":"IF([1]Sheet1!G71=\"\",\"\",[1]Sheet1!G71)","v":""},{"$f":"IF([1]Sheet1!H71=\"\",\"\",[1]Sheet1!H71)","v":14508},{"$f":"IF([1]Sheet1!I71=\"\",\"\",[1]Sheet1!I71)","v":"LINDE 02"},{"$f":"IF([1]Sheet1!J71=\"\",\"\",[1]Sheet1!J71)","v":""},{"$f":"IF([1]Sheet1!K71=\"\",\"\",[1]Sheet1!K71)","v":""},{"$f":"IF([1]Sheet1!L71=\"\",\"\",[1]Sheet1!L71)","v":52.33}]
[{"$f":"IF([1]Sheet1!A72=\"\",\"\",[1]Sheet1!A72)","v":"2012-10-18"},{"$f":"IF([1]Sheet1!B72=\"\",\"\",[1]Sheet1!B72)","v":"15:14"},{"$f":"IF([1]Sheet1!C72=\"\",\"\",[1]Sheet1!C72)","v":1},{"$f":"IF([1]Sheet1!D72=\"\",\"\",[1]Sheet1!D72)","v":"013"},{"$f":"COUNTIF(D72,\"???\")","v":1},{"$f":"IF(E72=0,\"00\"&D72,D72)","v":"013"},{"$f":"IF([1]Sheet1!G72=\"\",\"\",[1]Sheet1!G72)","v":""},{"$f":"IF([1]Sheet1!H72=\"\",\"\",[1]Sheet1!H72)","v":19605},{"$f":"IF([1]Sheet1!I72=\"\",\"\",[1]Sheet1!I72)","v":"LINDE 03"},{"$f":"IF([1]Sheet1!J72=\"\",\"\",[1]Sheet1!J72)","v":""},{"$f":"IF([1]Sheet1!K72=\"\",\"\",[1]Sheet1!K72)","v":""},{"$f":"IF([1]Sheet1!L72=\"\",\"\",[1]Sheet1!L72)","v":52.14}]
[{"$f":"IF([1]Sheet1!A73=\"\",\"\",[1]Sheet1!A73)","v":"2012-10-19"},{"$f":"IF([1]Sheet1!B73=\"\",\"\",[1]Sheet1!B73)","v":"13:23"},{"$f":"IF([1]Sheet1!C73=\"\",\"\",[1]Sheet1!C73)","v":1},{"$f":"IF([1]Sheet1!D73=\"\",\"\",[1]Sheet1!D73)","v":"008"},1,"008",{"$f":"IF([1]Sheet1!G73=\"\",\"\",[1]Sheet1!G73)","v":""},{"$f":"IF([1]Sheet1!H73=\"\",\"\",[1]Sheet1!H73)","v":14528},{"$f":"IF([1]Sheet1!I73=\"\",\"\",[1]Sheet1!I73)","v":"LINDE 02"},{"$f":"IF([1]Sheet1!J73=\"\",\"\",[1]Sheet1!J73)","v":""},{"$f":"IF([1]Sheet1!K73=\"\",\"\",[1]Sheet1!K73)","v":""},{"$f":"IF([1]Sheet1!L73=\"\",\"\",[1]Sheet1!L73)","v":54.11}]
[{"$f":"IF([1]Sheet1!A74=\"\",\"\",[1]Sheet1!A74)","v":"2012-10-19"},{"$f":"IF([1]Sheet1!B74=\"\",\"\",[1]Sheet1!B74)","v":"13:32"},{"$f":"IF([1]Sheet1!C74=\"\",\"\",[1]Sheet1!C74)","v":1},{"$f":"IF([1]Sheet1!D74=\"\",\"\",[1]Sheet1!D74)","v":"004"},1,"004",{"$f":"IF([1]Sheet1!G74=\"\",\"\",[1]Sheet1!G74)","v":""},{"$f":"IF([1]Sheet1!H74=\"\",\"\",[1]Sheet1!H74)","v":13701},{"$f":"IF([1]Sheet1!I74=\"\",\"\",[1]Sheet1!I74)","v":"LINDE 01"},{"$f":"IF([1]Sheet1!J74=\"\",\"\",[1]Sheet1!J74)","v":""},{"$f":"IF([1]Sheet1!K74=\"\",\"\",[1]Sheet1!K74)","v":""},{"$f":"IF([1]Sheet1!L74=\"\",\"\",[1]Sheet1!L74)","v":50.82}]
[{"$f":"IF([1]Sheet1!A75=\"\",\"\",[1]Sheet1!A75)","v":"2012-10-20"},{"$f":"IF([1]Sheet1!B75=\"\",\"\",[1]Sheet1!B75)","v":"13:03"},{"$f":"IF([1]Sheet1!C75=\"\",\"\",[1]Sheet1!C75)","v":1},{"$f":"IF([1]Sheet1!D75=\"\",\"\",[1]Sheet1!D75)","v":"008"},1,"008",{"$f":"IF([1]Sheet1!G75=\"\",\"\",[1]Sheet1!G75)","v":""},{"$f":"IF([1]Sheet1!H75=\"\",\"\",[1]Sheet1!H75)","v":14541},{"$f":"IF([1]Sheet1!I75=\"\",\"\",[1]Sheet1!I75)","v":"LINDE 02"},{"$f":"IF([1]Sheet1!J75=\"\",\"\",[1]Sheet1!J75)","v":""},{"$f":"IF([1]Sheet1!K75=\"\",\"\",[1]Sheet1!K75)","v":""},{"$f":"IF([1]Sheet1!L75=\"\",\"\",[1]Sheet1!L75)","v":37.28}]
[{"$f":"IF([1]Sheet1!A76=\"\",\"\",[1]Sheet1!A76)","v":"2012-10-20"},{"$f":"IF([1]Sheet1!B76=\"\",\"\",[1]Sheet1!B76)","v":"13:06"},{"$f":"IF([1]Sheet1!C76=\"\",\"\",[1]Sheet1!C76)","v":1},{"$f":"IF([1]Sheet1!D76=\"\",\"\",[1]Sheet1!D76)","v":"004"},1,"004",{"$f":"IF([1]Sheet1!G76=\"\",\"\",[1]Sheet1!G76)","v":""},{"$f":"IF([1]Sheet1!H76=\"\",\"\",[1]Sheet1!H76)","v":13713},{"$f":"IF([1]Sheet1!I76=\"\",\"\",[1]Sheet1!I76)","v":"LINDE 01"},{"$f":"IF([1]Sheet1!J76=\"\",\"\",[1]Sheet1!J76)","v":""},{"$f":"IF([1]Sheet1!K76=\"\",\"\",[1]Sheet1!K76)","v":""},{"$f":"IF([1]Sheet1!L76=\"\",\"\",[1]Sheet1!L76)","v":40.05}]
[{"$f":"IF([1]Sheet1!A77=\"\",\"\",[1]Sheet1!A77)","v":"2012-10-21"},{"$f":"IF([1]Sheet1!B77=\"\",\"\",[1]Sheet1!B77)","v":"07:15"},{"$f":"IF([1]Sheet1!C77=\"\",\"\",[1]Sheet1!C77)","v":1},{"$f":"IF([1]Sheet1!D77=\"\",\"\",[1]Sheet1!D77)","v":"016"},1,"016",{"$f":"IF([1]Sheet1!G77=\"\",\"\",[1]Sheet1!G77)","v":""},{"$f":"IF([1]Sheet1!H77=\"\",\"\",[1]Sheet1!H77)","v":19627},{"$f":"IF([1]Sheet1!I77=\"\",\"\",[1]Sheet1!I77)","v":"LINDE 03"},{"$f":"IF([1]Sheet1!J77=\"\",\"\",[1]Sheet1!J77)","v":""},{"$f":"IF([1]Sheet1!K77=\"\",\"\",[1]Sheet1!K77)","v":""},{"$f":"IF([1]Sheet1!L77=\"\",\"\",[1]Sheet1!L77)","v":48.42}]
[{"$f":"IF([1]Sheet1!A78=\"\",\"\",[1]Sheet1!A78)","v":"2012-10-22"},{"$f":"IF([1]Sheet1!B78=\"\",\"\",[1]Sheet1!B78)","v":"12:32"},{"$f":"IF([1]Sheet1!C78=\"\",\"\",[1]Sheet1!C78)","v":1},{"$f":"IF([1]Sheet1!D78=\"\",\"\",[1]Sheet1!D78)","v":"013"},1,"013",{"$f":"IF([1]Sheet1!G78=\"\",\"\",[1]Sheet1!G78)","v":""},{"$f":"IF([1]Sheet1!H78=\"\",\"\",[1]Sheet1!H78)","v":19642},{"$f":"IF([1]Sheet1!I78=\"\",\"\",[1]Sheet1!I78)","v":"LINDE 03"},{"$f":"IF([1]Sheet1!J78=\"\",\"\",[1]Sheet1!J78)","v":""},{"$f":"IF([1]Sheet1!K78=\"\",\"\",[1]Sheet1!K78)","v":""},{"$f":"IF([1]Sheet1!L78=\"\",\"\",[1]Sheet1!L78)","v":34.56}]
[{"$f":"IF([1]Sheet1!A79=\"\",\"\",[1]Sheet1!A79)","v":"2012-10-22"},{"$f":"IF([1]Sheet1!B79=\"\",\"\",[1]Sheet1!B79)","v":"12:58"},{"$f":"IF([1]Sheet1!C79=\"\",\"\",[1]Sheet1!C79)","v":1},{"$f":"IF([1]Sheet1!D79=\"\",\"\",[1]Sheet1!D79)","v":"002"},1,"002",{"$f":"IF([1]Sheet1!G79=\"\",\"\",[1]Sheet1!G79)","v":""},{"$f":"IF([1]Sheet1!H79=\"\",\"\",[1]Sheet1!H79)","v":13731},{"$f":"IF([1]Sheet1!I79=\"\",\"\",[1]Sheet1!I79)","v":"LINDE 01"},{"$f":"IF([1]Sheet1!J79=\"\",\"\",[1]Sheet1!J79)","v":""},{"$f":"IF([1]Sheet1!K79=\"\",\"\",[1]Sheet1!K79)","v":""},{"$f":"IF([1]Sheet1!L79=\"\",\"\",[1]Sheet1!L79)","v":42.97}]
[{"$f":"IF([1]Sheet1!A80=\"\",\"\",[1]Sheet1!A80)","v":"2012-10-22"},{"$f":"IF([1]Sheet1!B80=\"\",\"\",[1]Sheet1!B80)","v":"13:41"},{"$f":"IF([1]Sheet1!C80=\"\",\"\",[1]Sheet1!C80)","v":1},{"$f":"IF([1]Sheet1!D80=\"\",\"\",[1]Sheet1!D80)","v":"101"},1,"101",{"$f":"IF([1]Sheet1!G80=\"\",\"\",[1]Sheet1!G80)","v":""},14553,{"$f":"IF([1]Sheet1!I80=\"\",\"\",[1]Sheet1!I80)","v":"LINDE 02"},{"$f":"IF([1]Sheet1!J80=\"\",\"\",[1]Sheet1!J80)","v":""},{"$f":"IF([1]Sheet1!K80=\"\",\"\",[1]Sheet1!K80)","v":""},{"$f":"IF([1]Sheet1!L80=\"\",\"\",[1]Sheet1!L80)","v":34.44}]
[{"$f":"IF([1]Sheet1!A81=\"\",\"\",[1]Sheet1!A81)","v":"2012-10-23"},{"$f":"IF([1]Sheet1!B81=\"\",\"\",[1]Sheet1!B81)","v":"13:06"},{"$f":"IF([1]Sheet1!C81=\"\",\"\",[1]Sheet1!C81)","v":1},{"$f":"IF([1]Sheet1!D81=\"\",\"\",[1]Sheet1!D81)","v":"002"},1,"002",{"$f":"IF([1]Sheet1!G81=\"\",\"\",[1]Sheet1!G81)","v":""},{"$f":"IF([1]Sheet1!H81=\"\",\"\",[1]Sheet1!H81)","v":13750},{"$f":"IF([1]Sheet1!I81=\"\",\"\",[1]Sheet1!I81)","v":"LINDE 01"},{"$f":"IF([1]Sheet1!J81=\"\",\"\",[1]Sheet1!J81)","v":""},{"$f":"IF([1]Sheet1!K81=\"\",\"\",[1]Sheet1!K81)","v":""},{"$f":"IF([1]Sheet1!L81=\"\",\"\",[1]Sheet1!L81)","v":50.480000000000004}]
[{"$f":"IF([1]Sheet1!A82=\"\",\"\",[1]Sheet1!A82)","v":"2012-10-23"},{"$f":"IF([1]Sheet1!B82=\"\",\"\",[1]Sheet1!B82)","v":"18:02"},{"$f":"IF([1]Sheet1!C82=\"\",\"\",[1]Sheet1!C82)","v":1},{"$f":"IF([1]Sheet1!D82=\"\",\"\",[1]Sheet1!D82)","v":"008"},1,"008",{"$f":"IF([1]Sheet1!G82=\"\",\"\",[1]Sheet1!G82)","v":""},{"$f":"IF([1]Sheet1!H82=\"\",\"\",[1]Sheet1!H82)","v":14573},{"$f":"IF([1]Sheet1!I82=\"\",\"\",[1]Sheet1!I82)","v":"LINDE 02"},{"$f":"IF([1]Sheet1!J82=\"\",\"\",[1]Sheet1!J82)","v":""},{"$f":"IF([1]Sheet1!K82=\"\",\"\",[1]Sheet1!K82)","v":""},{"$f":"IF([1]Sheet1!L82=\"\",\"\",[1]Sheet1!L82)","v":55.870000000000005}]
[{"$f":"IF([1]Sheet1!A83=\"\",\"\",[1]Sheet1!A83)","v":"2012-10-24"},{"$f":"IF([1]Sheet1!B83=\"\",\"\",[1]Sheet1!B83)","v":"10:18"},{"$f":"IF([1]Sheet1!C83=\"\",\"\",[1]Sheet1!C83)","v":1},{"$f":"IF([1]Sheet1!D83=\"\",\"\",[1]Sheet1!D83)","v":"012"},1,"012",{"$f":"IF([1]Sheet1!G83=\"\",\"\",[1]Sheet1!G83)","v":""},{"$f":"IF([1]Sheet1!H83=\"\",\"\",[1]Sheet1!H83)","v":19660},{"$f":"IF([1]Sheet1!I83=\"\",\"\",[1]Sheet1!I83)","v":"LINDE 03"},{"$f":"IF([1]Sheet1!J83=\"\",\"\",[1]Sheet1!J83)","v":""},{"$f":"IF([1]Sheet1!K83=\"\",\"\",[1]Sheet1!K83)","v":""},{"$f":"IF([1]Sheet1!L83=\"\",\"\",[1]Sheet1!L83)","v":41.13}]
[{"$f":"IF([1]Sheet1!A84=\"\",\"\",[1]Sheet1!A84)","v":"2012-10-24"},{"$f":"IF([1]Sheet1!B84=\"\",\"\",[1]Sheet1!B84)","v":"13:04"},{"$f":"IF([1]Sheet1!C84=\"\",\"\",[1]Sheet1!C84)","v":1},{"$f":"IF([1]Sheet1!D84=\"\",\"\",[1]Sheet1!D84)","v":"002"},1,"002",{"$f":"IF([1]Sheet1!G84=\"\",\"\",[1]Sheet1!G84)","v":""},{"$f":"IF([1]Sheet1!H84=\"\",\"\",[1]Sheet1!H84)","v":13768},{"$f":"IF([1]Sheet1!I84=\"\",\"\",[1]Sheet1!I84)","v":"LINDE 01"},{"$f":"IF([1]Sheet1!J84=\"\",\"\",[1]Sheet1!J84)","v":""},{"$f":"IF([1]Sheet1!K84=\"\",\"\",[1]Sheet1!K84)","v":""},{"$f":"IF([1]Sheet1!L84=\"\",\"\",[1]Sheet1!L84)","v":49.19}]
[{"$f":"IF([1]Sheet1!A85=\"\",\"\",[1]Sheet1!A85)","v":"2012-10-24"},{"$f":"IF([1]Sheet1!B85=\"\",\"\",[1]Sheet1!B85)","v":"18:18"},{"$f":"IF([1]Sheet1!C85=\"\",\"\",[1]Sheet1!C85)","v":1},{"$f":"IF([1]Sheet1!D85=\"\",\"\",[1]Sheet1!D85)","v":"008"},1,"008",{"$f":"IF([1]Sheet1!G85=\"\",\"\",[1]Sheet1!G85)","v":""},{"$f":"IF([1]Sheet1!H85=\"\",\"\",[1]Sheet1!H85)","v":14590},{"$f":"IF([1]Sheet1!I85=\"\",\"\",[1]Sheet1!I85)","v":"LINDE 02"},{"$f":"IF([1]Sheet1!J85=\"\",\"\",[1]Sheet1!J85)","v":""},{"$f":"IF([1]Sheet1!K85=\"\",\"\",[1]Sheet1!K85)","v":""},{"$f":"IF([1]Sheet1!L85=\"\",\"\",[1]Sheet1!L85)","v":49.34}]
[{"$f":"IF([1]Sheet1!A86=\"\",\"\",[1]Sheet1!A86)","v":"2012-10-25"},{"$f":"IF([1]Sheet1!B86=\"\",\"\",[1]Sheet1!B86)","v":"12:56"},{"$f":"IF([1]Sheet1!C86=\"\",\"\",[1]Sheet1!C86)","v":1},{"$f":"IF([1]Sheet1!D86=\"\",\"\",[1]Sheet1!D86)","v":"106"},1,"106",{"$f":"IF([1]Sheet1!G86=\"\",\"\",[1]Sheet1!G86)","v":""},{"$f":"IF([1]Sheet1!H86=\"\",\"\",[1]Sheet1!H86)","v":49749},{"$f":"IF([1]Sheet1!I86=\"\",\"\",[1]Sheet1!I86)","v":"SUR"},{"$f":"IF([1]Sheet1!J86=\"\",\"\",[1]Sheet1!J86)","v":""},{"$f":"IF([1]Sheet1!K86=\"\",\"\",[1]Sheet1!K86)","v":""},{"$f":"IF([1]Sheet1!L86=\"\",\"\",[1]Sheet1!L86)","v":56.67}]
[{"$f":"IF([1]Sheet1!A87=\"\",\"\",[1]Sheet1!A87)","v":"2012-10-25"},{"$f":"IF([1]Sheet1!B87=\"\",\"\",[1]Sheet1!B87)","v":"13:03"},{"$f":"IF([1]Sheet1!C87=\"\",\"\",[1]Sheet1!C87)","v":1},{"$f":"IF([1]Sheet1!D87=\"\",\"\",[1]Sheet1!D87)","v":"005"},1,"005",{"$f":"IF([1]Sheet1!G87=\"\",\"\",[1]Sheet1!G87)","v":""},{"$f":"IF([1]Sheet1!H87=\"\",\"\",[1]Sheet1!H87)","v":14604},{"$f":"IF([1]Sheet1!I87=\"\",\"\",[1]Sheet1!I87)","v":"LINDE 02"},{"$f":"IF([1]Sheet1!J87=\"\",\"\",[1]Sheet1!J87)","v":""},{"$f":"IF([1]Sheet1!K87=\"\",\"\",[1]Sheet1!K87)","v":""},{"$f":"IF([1]Sheet1!L87=\"\",\"\",[1]Sheet1!L87)","v":34.62}]
[{"$f":"IF([1]Sheet1!A88=\"\",\"\",[1]Sheet1!A88)","v":"2012-10-25"},{"$f":"IF([1]Sheet1!B88=\"\",\"\",[1]Sheet1!B88)","v":"13:23"},{"$f":"IF([1]Sheet1!C88=\"\",\"\",[1]Sheet1!C88)","v":1},{"$f":"IF([1]Sheet1!D88=\"\",\"\",[1]Sheet1!D88)","v":"001"},1,"001",{"$f":"IF([1]Sheet1!G88=\"\",\"\",[1]Sheet1!G88)","v":""},{"$f":"IF([1]Sheet1!H88=\"\",\"\",[1]Sheet1!H88)","v":13785},{"$f":"IF([1]Sheet1!I88=\"\",\"\",[1]Sheet1!I88)","v":"LINDE 01"},{"$f":"IF([1]Sheet1!J88=\"\",\"\",[1]Sheet1!J88)","v":""},{"$f":"IF([1]Sheet1!K88=\"\",\"\",[1]Sheet1!K88)","v":""},{"$f":"IF([1]Sheet1!L88=\"\",\"\",[1]Sheet1!L88)","v":53.230000000000004}]
[{"$f":"IF([1]Sheet1!A89=\"\",\"\",[1]Sheet1!A89)","v":"2012-10-26"},{"$f":"IF([1]Sheet1!B89=\"\",\"\",[1]Sheet1!B89)","v":"11:16"},{"$f":"IF([1]Sheet1!C89=\"\",\"\",[1]Sheet1!C89)","v":1},{"$f":"IF([1]Sheet1!D89=\"\",\"\",[1]Sheet1!D89)","v":"001"},1,"001",{"$f":"IF([1]Sheet1!G89=\"\",\"\",[1]Sheet1!G89)","v":""},{"$f":"IF([1]Sheet1!H89=\"\",\"\",[1]Sheet1!H89)","v":14618},{"$f":"IF([1]Sheet1!I89=\"\",\"\",[1]Sheet1!I89)","v":"LINDE 02"},{"$f":"IF([1]Sheet1!J89=\"\",\"\",[1]Sheet1!J89)","v":""},{"$f":"IF([1]Sheet1!K89=\"\",\"\",[1]Sheet1!K89)","v":""},{"$f":"IF([1]Sheet1!L89=\"\",\"\",[1]Sheet1!L89)","v":46.410000000000004}]
[{"$f":"IF([1]Sheet1!A90=\"\",\"\",[1]Sheet1!A90)","v":"2012-10-26"},{"$f":"IF([1]Sheet1!B90=\"\",\"\",[1]Sheet1!B90)","v":"11:56"},{"$f":"IF([1]Sheet1!C90=\"\",\"\",[1]Sheet1!C90)","v":1},{"$f":"IF([1]Sheet1!D90=\"\",\"\",[1]Sheet1!D90)","v":"015"},1,"015",{"$f":"IF([1]Sheet1!G90=\"\",\"\",[1]Sheet1!G90)","v":""},{"$f":"IF([1]Sheet1!H90=\"\",\"\",[1]Sheet1!H90)","v":19678},{"$f":"IF([1]Sheet1!I90=\"\",\"\",[1]Sheet1!I90)","v":"LINDE 03"},{"$f":"IF([1]Sheet1!J90=\"\",\"\",[1]Sheet1!J90)","v":""},{"$f":"IF([1]Sheet1!K90=\"\",\"\",[1]Sheet1!K90)","v":""},{"$f":"IF([1]Sheet1!L90=\"\",\"\",[1]Sheet1!L90)","v":43.95}]
[{"$f":"IF([1]Sheet1!A91=\"\",\"\",[1]Sheet1!A91)","v":"2012-10-26"},{"$f":"IF([1]Sheet1!B91=\"\",\"\",[1]Sheet1!B91)","v":"18:39"},{"$f":"IF([1]Sheet1!C91=\"\",\"\",[1]Sheet1!C91)","v":1},{"$f":"IF([1]Sheet1!D91=\"\",\"\",[1]Sheet1!D91)","v":"002"},1,"002",{"$f":"IF([1]Sheet1!G91=\"\",\"\",[1]Sheet1!G91)","v":""},{"$f":"IF([1]Sheet1!H91=\"\",\"\",[1]Sheet1!H91)","v":13803},{"$f":"IF([1]Sheet1!I91=\"\",\"\",[1]Sheet1!I91)","v":"LINDE 01"},{"$f":"IF([1]Sheet1!J91=\"\",\"\",[1]Sheet1!J91)","v":""},{"$f":"IF([1]Sheet1!K91=\"\",\"\",[1]Sheet1!K91)","v":""},{"$f":"IF([1]Sheet1!L91=\"\",\"\",[1]Sheet1!L91)","v":48.36}]
[{"$f":"IF([1]Sheet1!A92=\"\",\"\",[1]Sheet1!A92)","v":"2012-10-27"},{"$f":"IF([1]Sheet1!B92=\"\",\"\",[1]Sheet1!B92)","v":"13:26"},{"$f":"IF([1]Sheet1!C92=\"\",\"\",[1]Sheet1!C92)","v":1},{"$f":"IF([1]Sheet1!D92=\"\",\"\",[1]Sheet1!D92)","v":"005"},1,"005",{"$f":"IF([1]Sheet1!G92=\"\",\"\",[1]Sheet1!G92)","v":""},{"$f":"IF([1]Sheet1!H92=\"\",\"\",[1]Sheet1!H92)","v":14634},{"$f":"IF([1]Sheet1!I92=\"\",\"\",[1]Sheet1!I92)","v":"LINDE 02"},{"$f":"IF([1]Sheet1!J92=\"\",\"\",[1]Sheet1!J92)","v":""},{"$f":"IF([1]Sheet1!K92=\"\",\"\",[1]Sheet1!K92)","v":""},{"$f":"IF([1]Sheet1!L92=\"\",\"\",[1]Sheet1!L92)","v":43.67}]
[{"$f":"IF([1]Sheet1!A93=\"\",\"\",[1]Sheet1!A93)","v":"2012-10-28"},{"$f":"IF([1]Sheet1!B93=\"\",\"\",[1]Sheet1!B93)","v":"12:45"},{"$f":"IF([1]Sheet1!C93=\"\",\"\",[1]Sheet1!C93)","v":1},{"$f":"IF([1]Sheet1!D93=\"\",\"\",[1]Sheet1!D93)","v":"001"},1,"001",{"$f":"IF([1]Sheet1!G93=\"\",\"\",[1]Sheet1!G93)","v":""},{"$f":"IF([1]Sheet1!H93=\"\",\"\",[1]Sheet1!H93)","v":13817},{"$f":"IF([1]Sheet1!I93=\"\",\"\",[1]Sheet1!I93)","v":"LINDE 01"},{"$f":"IF([1]Sheet1!J93=\"\",\"\",[1]Sheet1!J93)","v":""},{"$f":"IF([1]Sheet1!K93=\"\",\"\",[1]Sheet1!K93)","v":""},{"$f":"IF([1]Sheet1!L93=\"\",\"\",[1]Sheet1!L93)","v":35.18}]
[{"$f":"IF([1]Sheet1!A94=\"\",\"\",[1]Sheet1!A94)","v":"2012-10-28"},{"$f":"IF([1]Sheet1!B94=\"\",\"\",[1]Sheet1!B94)","v":"16:21"},{"$f":"IF([1]Sheet1!C94=\"\",\"\",[1]Sheet1!C94)","v":1},{"$f":"IF([1]Sheet1!D94=\"\",\"\",[1]Sheet1!D94)","v":"012"},1,"012",{"$f":"IF([1]Sheet1!G94=\"\",\"\",[1]Sheet1!G94)","v":""},{"$f":"IF([1]Sheet1!H94=\"\",\"\",[1]Sheet1!H94)","v":19695},{"$f":"IF([1]Sheet1!I94=\"\",\"\",[1]Sheet1!I94)","v":"LINDE 03"},{"$f":"IF([1]Sheet1!J94=\"\",\"\",[1]Sheet1!J94)","v":""},{"$f":"IF([1]Sheet1!K94=\"\",\"\",[1]Sheet1!K94)","v":""},{"$f":"IF([1]Sheet1!L94=\"\",\"\",[1]Sheet1!L94)","v":43.43}]
[{"$f":"IF([1]Sheet1!A95=\"\",\"\",[1]Sheet1!A95)","v":"2012-10-29"},{"$f":"IF([1]Sheet1!B95=\"\",\"\",[1]Sheet1!B95)","v":"11:40"},{"$f":"IF([1]Sheet1!C95=\"\",\"\",[1]Sheet1!C95)","v":1},{"$f":"IF([1]Sheet1!D95=\"\",\"\",[1]Sheet1!D95)","v":"007"},1,"007",{"$f":"IF([1]Sheet1!G95=\"\",\"\",[1]Sheet1!G95)","v":""},{"$f":"IF([1]Sheet1!H95=\"\",\"\",[1]Sheet1!H95)","v":14652},{"$f":"IF([1]Sheet1!I95=\"\",\"\",[1]Sheet1!I95)","v":"LINDE 02"},{"$f":"IF([1]Sheet1!J95=\"\",\"\",[1]Sheet1!J95)","v":""},{"$f":"IF([1]Sheet1!K95=\"\",\"\",[1]Sheet1!K95)","v":""},{"$f":"IF([1]Sheet1!L95=\"\",\"\",[1]Sheet1!L95)","v":37.91}]
[{"$f":"IF([1]Sheet1!A96=\"\",\"\",[1]Sheet1!A96)","v":"2012-10-29"},{"$f":"IF([1]Sheet1!B96=\"\",\"\",[1]Sheet1!B96)","v":"13:54"},{"$f":"IF([1]Sheet1!C96=\"\",\"\",[1]Sheet1!C96)","v":1},{"$f":"IF([1]Sheet1!D96=\"\",\"\",[1]Sheet1!D96)","v":"003"},1,"003",{"$f":"IF([1]Sheet1!G96=\"\",\"\",[1]Sheet1!G96)","v":""},{"$f":"IF([1]Sheet1!H96=\"\",\"\",[1]Sheet1!H96)","v":13823},{"$f":"IF([1]Sheet1!I96=\"\",\"\",[1]Sheet1!I96)","v":"LINDE 01"},{"$f":"IF([1]Sheet1!J96=\"\",\"\",[1]Sheet1!J96)","v":""},{"$f":"IF([1]Sheet1!K96=\"\",\"\",[1]Sheet1!K96)","v":""},{"$f":"IF([1]Sheet1!L96=\"\",\"\",[1]Sheet1!L96)","v":19.78}]
[{"$f":"IF([1]Sheet1!A97=\"\",\"\",[1]Sheet1!A97)","v":"2012-10-30"},{"$f":"IF([1]Sheet1!B97=\"\",\"\",[1]Sheet1!B97)","v":"08:26"},{"$f":"IF([1]Sheet1!C97=\"\",\"\",[1]Sheet1!C97)","v":1},{"$f":"IF([1]Sheet1!D97=\"\",\"\",[1]Sheet1!D97)","v":"007"},1,"007",{"$f":"IF([1]Sheet1!G97=\"\",\"\",[1]Sheet1!G97)","v":""},{"$f":"IF([1]Sheet1!H97=\"\",\"\",[1]Sheet1!H97)","v":14668},{"$f":"IF([1]Sheet1!I97=\"\",\"\",[1]Sheet1!I97)","v":"LINDE 02"},{"$f":"IF([1]Sheet1!J97=\"\",\"\",[1]Sheet1!J97)","v":""},{"$f":"IF([1]Sheet1!K97=\"\",\"\",[1]Sheet1!K97)","v":""},{"$f":"IF([1]Sheet1!L97=\"\",\"\",[1]Sheet1!L97)","v":54.230000000000004}]
[{"$f":"IF([1]Sheet1!A98=\"\",\"\",[1]Sheet1!A98)","v":"2012-10-30"},{"$f":"IF([1]Sheet1!B98=\"\",\"\",[1]Sheet1!B98)","v":"12:59"},{"$f":"IF([1]Sheet1!C98=\"\",\"\",[1]Sheet1!C98)","v":1},204,{"$f":"COUNTIF(D98,\"???\")","v":0},204,{"$f":"IF([1]Sheet1!G98=\"\",\"\",[1]Sheet1!G98)","v":""},{"$f":"IF([1]Sheet1!H98=\"\",\"\",[1]Sheet1!H98)","v":62370},{"$f":"IF([1]Sheet1!I98=\"\",\"\",[1]Sheet1!I98)","v":"SMP"},{"$f":"IF([1]Sheet1!J98=\"\",\"\",[1]Sheet1!J98)","v":""},{"$f":"IF([1]Sheet1!K98=\"\",\"\",[1]Sheet1!K98)","v":""},{"$f":"IF([1]Sheet1!L98=\"\",\"\",[1]Sheet1!L98)","v":54.85}]
[{"$f":"IF([1]Sheet1!A99=\"\",\"\",[1]Sheet1!A99)","v":"2012-10-30"},{"$f":"IF([1]Sheet1!B99=\"\",\"\",[1]Sheet1!B99)","v":"14:15"},{"$f":"IF([1]Sheet1!C99=\"\",\"\",[1]Sheet1!C99)","v":1},{"$f":"IF([1]Sheet1!D99=\"\",\"\",[1]Sheet1!D99)","v":"003"},1,{"$f":"IF(E99=0,\"00\"&D99,D99)","v":"003"},{"$f":"IF([1]Sheet1!G99=\"\",\"\",[1]Sheet1!G99)","v":""},{"$f":"IF([1]Sheet1!H99=\"\",\"\",[1]Sheet1!H99)","v":13834},{"$f":"IF([1]Sheet1!I99=\"\",\"\",[1]Sheet1!I99)","v":"LINDE 01"},{"$f":"IF([1]Sheet1!J99=\"\",\"\",[1]Sheet1!J99)","v":""},{"$f":"IF([1]Sheet1!K99=\"\",\"\",[1]Sheet1!K99)","v":""},{"$f":"IF([1]Sheet1!L99=\"\",\"\",[1]Sheet1!L99)","v":36.84}]
[{"$f":"IF([1]Sheet1!A100=\"\",\"\",[1]Sheet1!A100)","v":"2012-10-30"},{"$f":"IF([1]Sheet1!B100=\"\",\"\",[1]Sheet1!B100)","v":"14:23"},{"$f":"IF([1]Sheet1!C100=\"\",\"\",[1]Sheet1!C100)","v":1},{"$f":"IF([1]Sheet1!D100=\"\",\"\",[1]Sheet1!D100)","v":"017"},{"$f":"COUNTIF(D100,\"???\")","v":1},"017",{"$f":"IF([1]Sheet1!G100=\"\",\"\",[1]Sheet1!G100)","v":""},{"$f":"IF([1]Sheet1!H100=\"\",\"\",[1]Sheet1!H100)","v":19715},{"$f":"IF([1]Sheet1!I100=\"\",\"\",[1]Sheet1!I100)","v":"LINDE 03"},{"$f":"IF([1]Sheet1!J100=\"\",\"\",[1]Sheet1!J100)","v":""},{"$f":"IF([1]Sheet1!K100=\"\",\"\",[1]Sheet1!K100)","v":""},{"$f":"IF([1]Sheet1!L100=\"\",\"\",[1]Sheet1!L100)","v":44.9}]
[{"$f":"IF([1]Sheet1!A101=\"\",\"\",[1]Sheet1!A101)","v":"2012-10-31"},{"$f":"IF([1]Sheet1!B101=\"\",\"\",[1]Sheet1!B101)","v":"09:55"},{"$f":"IF([1]Sheet1!C101=\"\",\"\",[1]Sheet1!C101)","v":1},{"$f":"IF([1]Sheet1!D101=\"\",\"\",[1]Sheet1!D101)","v":"003"},1,"003",{"$f":"IF([1]Sheet1!G101=\"\",\"\",[1]Sheet1!G101)","v":""},{"$f":"IF([1]Sheet1!H101=\"\",\"\",[1]Sheet1!H101)","v":13851},{"$f":"IF([1]Sheet1!I101=\"\",\"\",[1]Sheet1!I101)","v":"LINDE 01"},{"$f":"IF([1]Sheet1!J101=\"\",\"\",[1]Sheet1!J101)","v":""},{"$f":"IF([1]Sheet1!K101=\"\",\"\",[1]Sheet1!K101)","v":""},{"$f":"IF([1]Sheet1!L101=\"\",\"\",[1]Sheet1!L101)","v":52.18}]
[{"$f":"IF([1]Sheet1!A102=\"\",\"\",[1]Sheet1!A102)","v":"2012-10-31"},{"$f":"IF([1]Sheet1!B102=\"\",\"\",[1]Sheet1!B102)","v":"11:01"},{"$f":"IF([1]Sheet1!C102=\"\",\"\",[1]Sheet1!C102)","v":1},{"$f":"IF([1]Sheet1!D102=\"\",\"\",[1]Sheet1!D102)","v":"207"},1,"207",{"$f":"IF([1]Sheet1!G102=\"\",\"\",[1]Sheet1!G102)","v":""},{"$f":"IF([1]Sheet1!H102=\"\",\"\",[1]Sheet1!H102)","v":70490},{"$f":"IF([1]Sheet1!I102=\"\",\"\",[1]Sheet1!I102)","v":"SMP"},{"$f":"IF([1]Sheet1!J102=\"\",\"\",[1]Sheet1!J102)","v":""},{"$f":"IF([1]Sheet1!K102=\"\",\"\",[1]Sheet1!K102)","v":""},{"$f":"IF([1]Sheet1!L102=\"\",\"\",[1]Sheet1!L102)","v":72.14}]
[{"$f":"IF([1]Sheet1!A103=\"\",\"\",[1]Sheet1!A103)","v":"2012-10-31"},{"$f":"IF([1]Sheet1!B103=\"\",\"\",[1]Sheet1!B103)","v":"11:59"},{"$f":"IF([1]Sheet1!C103=\"\",\"\",[1]Sheet1!C103)","v":1},{"$f":"IF([1]Sheet1!D103=\"\",\"\",[1]Sheet1!D103)","v":"007"},1,"007",{"$f":"IF([1]Sheet1!G103=\"\",\"\",[1]Sheet1!G103)","v":""},{"$f":"IF([1]Sheet1!H103=\"\",\"\",[1]Sheet1!H103)","v":14683},{"$f":"IF([1]Sheet1!I103=\"\",\"\",[1]Sheet1!I103)","v":"LINDE 02"},{"$f":"IF([1]Sheet1!J103=\"\",\"\",[1]Sheet1!J103)","v":""},{"$f":"IF([1]Sheet1!K103=\"\",\"\",[1]Sheet1!K103)","v":""},{"$f":"IF([1]Sheet1!L103=\"\",\"\",[1]Sheet1!L103)","v":47.21}]
[{"$f":"IF([1]Sheet1!A104=\"\",\"\",[1]Sheet1!A104)","v":"2012-11-01"},{"$f":"IF([1]Sheet1!B104=\"\",\"\",[1]Sheet1!B104)","v":"14:06"},{"$f":"IF([1]Sheet1!C104=\"\",\"\",[1]Sheet1!C104)","v":1},{"$f":"IF([1]Sheet1!D104=\"\",\"\",[1]Sheet1!D104)","v":"003"},1,"003",{"$f":"IF([1]Sheet1!G104=\"\",\"\",[1]Sheet1!G104)","v":""},13874,{"$f":"IF([1]Sheet1!I104=\"\",\"\",[1]Sheet1!I104)","v":"LINDE 01"},{"$f":"IF([1]Sheet1!J104=\"\",\"\",[1]Sheet1!J104)","v":""},{"$f":"IF([1]Sheet1!K104=\"\",\"\",[1]Sheet1!K104)","v":""},{"$f":"IF([1]Sheet1!L104=\"\",\"\",[1]Sheet1!L104)","v":42.410000000000004}]
[{"$f":"IF([1]Sheet1!A105=\"\",\"\",[1]Sheet1!A105)","v":"2012-11-02"},{"$f":"IF([1]Sheet1!B105=\"\",\"\",[1]Sheet1!B105)","v":"13:21"},{"$f":"IF([1]Sheet1!C105=\"\",\"\",[1]Sheet1!C105)","v":1},{"$f":"IF([1]Sheet1!D105=\"\",\"\",[1]Sheet1!D105)","v":"005"},1,"005",{"$f":"IF([1]Sheet1!G105=\"\",\"\",[1]Sheet1!G105)","v":""},{"$f":"IF([1]Sheet1!H105=\"\",\"\",[1]Sheet1!H105)","v":14701},{"$f":"IF([1]Sheet1!I105=\"\",\"\",[1]Sheet1!I105)","v":"LINDE 02"},{"$f":"IF([1]Sheet1!J105=\"\",\"\",[1]Sheet1!J105)","v":""},{"$f":"IF([1]Sheet1!K105=\"\",\"\",[1]Sheet1!K105)","v":""},{"$f":"IF([1]Sheet1!L105=\"\",\"\",[1]Sheet1!L105)","v":39.45}]
[{"$f":"IF([1]Sheet1!A106=\"\",\"\",[1]Sheet1!A106)","v":""},{"$f":"IF([1]Sheet1!B106=\"\",\"\",[1]Sheet1!B106)","v":""},{"$f":"IF([1]Sheet1!C106=\"\",\"\",[1]Sheet1!C106)","v":""},{"$f":"IF([1]Sheet1!D106=\"\",\"\",[1]Sheet1!D106)","v":""},{"$f":"COUNTIF(D106,\"???\")","v":0},{"$f":"IF(E106=0,\"00\"&D106,D106)","v":"00"},{"$f":"IF([1]Sheet1!G106=\"\",\"\",[1]Sheet1!G106)","v":""},{"$f":"IF([1]Sheet1!H106=\"\",\"\",[1]Sheet1!H106)","v":""},{"$f":"IF([1]Sheet1!I106=\"\",\"\",[1]Sheet1!I106)","v":""},{"$f":"IF([1]Sheet1!J106=\"\",\"\",[1]Sheet1!J106)","v":""},{"$f":"IF([1]Sheet1!K106=\"\",\"\",[1]Sheet1!K106)","v":""},{"$f":"IF([1]Sheet1!L106=\"\",\"\",[1]Sheet1!L106)","v":""}]
[{"$f":"IF([1]Sheet1!A107=\"\",\"\",[1]Sheet1!A107)","v":""},{"$f":"IF([1]Sheet1!B107=\"\",\"\",[1]Sheet1!B107)","v":""},{"$f":"IF([1]Sheet1!C107=\"\",\"\",[1]Sheet1!C107)","v":""},{"$f":"IF([1]Sheet1!D107=\"\",\"\",[1]Sheet1!D107)","v":""},0,"00",{"$f":"IF([1]Sheet1!G107=\"\",\"\",[1]Sheet1!G107)","v":""},{"$f":"IF([1]Sheet1!H107=\"\",\"\",[1]Sheet1!H107)","v":""},{"$f":"IF([1]Sheet1!I107=\"\",\"\",[1]Sheet1!I107)","v":""},{"$f":"IF([1]Sheet1!J107=\"\",\"\",[1]Sheet1!J107)","v":""},{"$f":"IF([1]Sheet1!K107=\"\",\"\",[1]Sheet1!K107)","v":""},{"$f":"IF([1]Sheet1!L107=\"\",\"\",[1]Sheet1!L107)","v":""}]
[{"$f":"IF([1]Sheet1!A108=\"\",\"\",[1]Sheet1!A108)","v":""},{"$f":"IF([1]Sheet1!B108=\"\",\"\",[1]Sheet1!B108)","v":""},{"$f":"IF([1]Sheet1!C108=\"\",\"\",[1]Sheet1!C108)","v":""},{"$f":"IF([1]Sheet1!D108=\"\",\"\",[1]Sheet1!D108)","v":""},0,"00",{"$f":"IF([1]Sheet1!G108=\"\",\"\",[1]Sheet1!G108)","v":""},{"$f":"IF([1]Sheet1!H108=\"\",\"\",[1]Sheet1!H108)","v":1},{"$f":"IF([1]Sheet1!I108=\"\",\"\",[1]Sheet1!I108)","v":""},{"$f":"IF([1]Sheet1!J108=\"\",\"\",[1]Sheet1!J108)","v":""},{"$f":"IF([1]Sheet1!K108=\"\",\"\",[1]Sheet1!K108)","v":""},{"$f":"IF([1]Sheet1!L108=\"\",\"\",[1]Sheet1!L108)","v":""}]
[{"$f":"IF([1]Sheet1!A109=\"\",\"\",[1]Sheet1!A109)","v":""},{"$f":"IF([1]Sheet1!B109=\"\",\"\",[1]Sheet1!B109)","v":""},{"$f":"IF([1]Sheet1!C109=\"\",\"\",[1]Sheet1!C109)","v":""},{"$f":"IF([1]Sheet1!D109=\"\",\"\",[1]Sheet1!D109)","v":""},0,"00",{"$f":"IF([1]Sheet1!G109=\"\",\"\",[1]Sheet1!G109)","v":""},{"$f":"IF([1]Sheet1!H109=\"\",\"\",[1]Sheet1!H109)","v":""},{"$f":"IF([1]Sheet1!I109=\"\",\"\",[1]Sheet1!I109)","v":""},{"$f":"IF([1]Sheet1!J109=\"\",\"\",[1]Sheet1!J109)","v":""},{"$f":"IF([1]Sheet1!K109=\"\",\"\",[1]Sheet1!K109)","v":""},{"$f":"IF([1]Sheet1!L109=\"\",\"\",[1]Sheet1!L109)","v":""}]
[{"$f":"IF([1]Sheet1!A110=\"\",\"\",[1]Sheet1!A110)","v":""},{"$f":"IF([1]Sheet1!B110=\"\",\"\",[1]Sheet1!B110)","v":""},{"$f":"IF([1]Sheet1!C110=\"\",\"\",[1]Sheet1!C110)","v":""},{"$f":"IF([1]Sheet1!D110=\"\",\"\",[1]Sheet1!D110)","v":""},0,"00",{"$f":"IF([1]Sheet1!G110=\"\",\"\",[1]Sheet1!G110)","v":""},{"$f":"IF([1]Sheet1!H110=\"\",\"\",[1]Sheet1!H110)","v":""},{"$f":"IF([1]Sheet1!I110=\"\",\"\",[1]Sheet1!I110)","v":""},{"$f":"IF([1]Sheet1!J110=\"\",\"\",[1]Sheet1!J110)","v":""},{"$f":"IF([1]Sheet1!K110=\"\",\"\",[1]Sheet1!K110)","v":""},{"$f":"IF([1]Sheet1!L110=\"\",\"\",[1]Sheet1!L110)","v":""}]
[{"$f":"IF([1]Sheet1!A111=\"\",\"\",[1]Sheet1!A111)","v":""},{"$f":"IF([1]Sheet1!B111=\"\",\"\",[1]Sheet1!B111)","v":""},{"$f":"IF([1]Sheet1!C111=\"\",\"\",[1]Sheet1!C111)","v":""},{"$f":"IF([1]Sheet1!D111=\"\",\"\",[1]Sheet1!D111)","v":""},0,"00",{"$f":"IF([1]Sheet1!G111=\"\",\"\",[1]Sheet1!G111)","v":""},{"$f":"IF([1]Sheet1!H111=\"\",\"\",[1]Sheet1!H111)","v":""},{"$f":"IF([1]Sheet1!I111=\"\",\"\",[1]Sheet1!I111)","v":""},{"$f":"IF([1]Sheet1!J111=\"\",\"\",[1]Sheet1!J111)","v":""},{"$f":"IF([1]Sheet1!K111=\"\",\"\",[1]Sheet1!K111)","v":""},{"$f":"IF([1]Sheet1!L111=\"\",\"\",[1]Sheet1!L111)","v":""}]
[{"$f":"IF([1]Sheet1!A112=\"\",\"\",[1]Sheet1!A112)","v":""},{"$f":"IF([1]Sheet1!B112=\"\",\"\",[1]Sheet1!B112)","v":""},{"$f":"IF([1]Sheet1!C112=\"\",\"\",[1]Sheet1!C112)","v":""},{"$f":"IF([1]Sheet1!D112=\"\",\"\",[1]Sheet1!D112)","v":""},0,"00",{"$f":"IF([1]Sheet1!G112=\"\",\"\",[1]Sheet1!G112)","v":""},{"$f":"IF([1]Sheet1!H112=\"\",\"\",[1]Sheet1!H112)","v":""},{"$f":"IF([1]Sheet1!I112=\"\",\"\",[1]Sheet1!I112)","v":""},{"$f":"IF([1]Sheet1!J112=\"\",\"\",[1]Sheet1!J112)","v":""},{"$f":"IF([1]Sheet1!K112=\"\",\"\",[1]Sheet1!K112)","v":""},{"$f":"IF([1]Sheet1!L112=\"\",\"\",[1]Sheet1!L112)","v":""}]
[{"$f":"IF([1]Sheet1!A113=\"\",\"\",[1]Sheet1!A113)","v":""},{"$f":"IF([1]Sheet1!B113=\"\",\"\",[1]Sheet1!B113)","v":""},{"$f":"IF([1]Sheet1!C113=\"\",\"\",[1]Sheet1!C113)","v":""},{"$f":"IF([1]Sheet1!D113=\"\",\"\",[1]Sheet1!D113)","v":""},0,"00",{"$f":"IF([1]Sheet1!G113=\"\",\"\",[1]Sheet1!G113)","v":""},{"$f":"IF([1]Sheet1!H113=\"\",\"\",[1]Sheet1!H113)","v":""},{"$f":"IF([1]Sheet1!I113=\"\",\"\",[1]Sheet1!I113)","v":""},{"$f":"IF([1]Sheet1!J113=\"\",\"\",[1]Sheet1!J113)","v":""},{"$f":"IF([1]Sheet1!K113=\"\",\"\",[1]Sheet1!K113)","v":""},{"$f":"IF([1]Sheet1!L113=\"\",\"\",[1]Sheet1!L113)","v":""}]
[{"$f":"IF([1]Sheet1!A114=\"\",\"\",[1]Sheet1!A114)","v":""},{"$f":"IF([1]Sheet1!B114=\"\",\"\",[1]Sheet1!B114)","v":""},{"$f":"IF([1]Sheet1!C114=\"\",\"\",[1]Sheet1!C114)","v":""},{"$f":"IF([1]Sheet1!D114=\"\",\"\",[1]Sheet1!D114)","v":""},0,"00",{"$f":"IF([1]Sheet1!G114=\"\",\"\",[1]Sheet1!G114)","v":""},{"$f":"IF([1]Sheet1!H114=\"\",\"\",[1]Sheet1!H114)","v":""},{"$f":"IF([1]Sheet1!I114=\"\",\"\",[1]Sheet1!I114)","v":""},{"$f":"IF([1]Sheet1!J114=\"\",\"\",[1]Sheet1!J114)","v":""},{"$f":"IF([1]Sheet1!K114=\"\",\"\",[1]Sheet1!K114)","v":""},{"$f":"IF([1]Sheet1!L114=\"\",\"\",[1]Sheet1!L114)","v":""}]
[{"$f":"IF([1]Sheet1!A115=\"\",\"\",[1]Sheet1!A115)","v":""},{"$f":"IF([1]Sheet1!B115=\"\",\"\",[1]Sheet1!B115)","v":""},{"$f":"IF([1]Sheet1!C115=\"\",\"\",[1]Sheet1!C115)","v":""},{"$f":"IF([1]Sheet1!D115=\"\",\"\",[1]Sheet1!D115)","v":""},0,"00",{"$f":"IF([1]Sheet1!G115=\"\",\"\",[1]Sheet1!G115)","v":""},{"$f":"IF([1]Sheet1!H115=\"\",\"\",[1]Sheet1!H115)","v":""},{"$f":"IF([1]Sheet1!I115=\"\",\"\",[1]Sheet1!I115)","v":""},{"$f":"IF([1]Sheet1!J115=\"\",\"\",[1]Sheet1!J115)","v":""},{"$f":"IF([1]Sheet1!K115=\"\",\"\",[1]Sheet1!K115)","v":""},{"$f":"IF([1]Sheet1!L115=\"\",\"\",[1]Sheet1!L115)","v":""}]
[{"$f":"IF([1]Sheet1!A116=\"\",\"\",[1]Sheet1!A116)","v":""},{"$f":"IF([1]Sheet1!B116=\"\",\"\",[1]Sheet1!B116)","v":""},{"$f":"IF([1]Sheet1!C116=\"\",\"\",[1]Sheet1!C116)","v":""},{"$f":"IF([1]Sheet1!D116=\"\",\"\",[1]Sheet1!D116)","v":""},0,"00",{"$f":"IF([1]Sheet1!G116=\"\",\"\",[1]Sheet1!G116)","v":""},{"$f":"IF([1]Sheet1!H116=\"\",\"\",[1]Sheet1!H116)","v":""},{"$f":"IF([1]Sheet1!I116=\"\",\"\",[1]Sheet1!I116)","v":""},{"$f":"IF([1]Sheet1!J116=\"\",\"\",[1]Sheet1!J116)","v":""},{"$f":"IF([1]Sheet1!K116=\"\",\"\",[1]Sheet1!K116)","v":""},{"$f":"IF([1]Sheet1!L116=\"\",\"\",[1]Sheet1!L116)","v":""}]
[{"$f":"IF([1]Sheet1!A117=\"\",\"\",[1]Sheet1!A117)","v":""},{"$f":"IF([1]Sheet1!B117=\"\",\"\",[1]Sheet1!B117)","v":""},{"$f":"IF([1]Sheet1!C117=\"\",\"\",[1]Sheet1!C117)","v":""},{"$f":"IF([1]Sheet1!D117=\"\",\"\",[1]Sheet1!D117)","v":""},0,"00",{"$f":"IF([1]Sheet1!G117=\"\",\"\",[1]Sheet1!G117)","v":""},{"$f":"IF([1]Sheet1!H117=\"\",\"\",[1]Sheet1!H117)","v":""},{"$f":"IF([1]Sheet1!I117=\"\",\"\",[1]Sheet1!I117)","v":""},{"$f":"IF([1]Sheet1!J117=\"\",\"\",[1]Sheet1!J117)","v":""},{"$f":"IF([1]Sheet1!K117=\"\",\"\",[1]Sheet1!K117)","v":""},{"$f":"IF([1]Sheet1!L117=\"\",\"\",[1]Sheet1!L117)","v":""}]
[{"$f":"IF([1]Sheet1!A118=\"\",\"\",[1]Sheet1!A118)","v":""},{"$f":"IF([1]Sheet1!B118=\"\",\"\",[1]Sheet1!B118)","v":""},{"$f":"IF([1]Sheet1!C118=\"\",\"\",[1]Sheet1!C118)","v":""},{"$f":"IF([1]Sheet1!D118=\"\",\"\",[1]Sheet1!D118)","v":""},0,"00",{"$f":"IF([1]Sheet1!G118=\"\",\"\",[1]Sheet1!G118)","v":""},{"$f":"IF([1]Sheet1!H118=\"\",\"\",[1]Sheet1!H118)","v":""},{"$f":"IF([1]Sheet1!I118=\"\",\"\",[1]Sheet1!I118)","v":""},{"$f":"IF([1]Sheet1!J118=\"\",\"\",[1]Sheet1!J118)","v":""},{"$f":"IF([1]Sheet1!K118=\"\",\"\",[1]Sheet1!K118)","v":""},{"$f":"IF([1]Sheet1!L118=\"\",\"\",[1]Sheet1!L118)","v":""}]
[{"$f":"IF([1]Sheet1!A119=\"\",\"\",[1]Sheet1!A119)","v":""},{"$f":"IF([1]Sheet1!B119=\"\",\"\",[1]Sheet1!B119)","v":""},{"$f":"IF([1]Sheet1!C119=\"\",\"\",[1]Sheet1!C119)","v":""},{"$f":"IF([1]Sheet1!D119=\"\",\"\",[1]Sheet1!D119)","v":""},0,"00",{"$f":"IF([1]Sheet1!G119=\"\",\"\",[1]Sheet1!G119)","v":""},{"$f":"IF([1]Sheet1!H119=\"\",\"\",[1]Sheet1!H119)","v":""},{"$f":"IF([1]Sheet1!I119=\"\",\"\",[1]Sheet1!I119)","v":""},{"$f":"IF([1]Sheet1!J119=\"\",\"\",[1]Sheet1!J119)","v":""},{"$f":"IF([1]Sheet1!K119=\"\",\"\",[1]Sheet1!K119)","v":""},{"$f":"IF([1]Sheet1!L119=\"\",\"\",[1]Sheet1!L119)","v":""}]
[{"$f":"IF([1]Sheet1!A120=\"\",\"\",[1]Sheet1!A120)","v":""},{"$f":"IF([1]Sheet1!B120=\"\",\"\",[1]Sheet1!B120)","v":""},{"$f":"IF([1]Sheet1!C120=\"\",\"\",[1]Sheet1!C120)","v":""},{"$f":"IF([1]Sheet1!D120=\"\",\"\",[1]Sheet1!D120)","v":""},0,"00",{"$f":"IF([1]Sheet1!G120=\"\",\"\",[1]Sheet1!G120)","v":""},{"$f":"IF([1]Sheet1!H120=\"\",\"\",[1]Sheet1!H120)","v":""},{"$f":"IF([1]Sheet1!I120=\"\",\"\",[1]Sheet1!I120)","v":""},{"$f":"IF([1]Sheet1!J120=\"\",\"\",[1]Sheet1!J120)","v":""},{"$f":"IF([1]Sheet1!K120=\"\",\"\",[1]Sheet1!K120)","v":""},{"$f":"IF([1]Sheet1!L120=\"\",\"\",[1]Sheet1!L120)","v":""}]
[{"$f":"IF([1]Sheet1!A121=\"\",\"\",[1]Sheet1!A121)","v":""},{"$f":"IF([1]Sheet1!B121=\"\",\"\",[1]Sheet1!B121)","v":""},{"$f":"IF([1]Sheet1!C121=\"\",\"\",[1]Sheet1!C121)","v":""},{"$f":"IF([1]Sheet1!D121=\"\",\"\",[1]Sheet1!D121)","v":""},0,"00",{"$f":"IF([1]Sheet1!G121=\"\",\"\",[1]Sheet1!G121)","v":""},{"$f":"IF([1]Sheet1!H121=\"\",\"\",[1]Sheet1!H121)","v":""},{"$f":"IF([1]Sheet1!I121=\"\",\"\",[1]Sheet1!I121)","v":""},{"$f":"IF([1]Sheet1!J121=\"\",\"\",[1]Sheet1!J121)","v":""},{"$f":"IF([1]Sheet1!K121=\"\",\"\",[1]Sheet1!K121)","v":""},{"$f":"IF([1]Sheet1!L121=\"\",\"\",[1]Sheet1!L121)","v":""}]
[{"$f":"IF([1]Sheet1!A122=\"\",\"\",[1]Sheet1!A122)","v":""},{"$f":"IF([1]Sheet1!B122=\"\",\"\",[1]Sheet1!B122)","v":""},{"$f":"IF([1]Sheet1!C122=\"\",\"\",[1]Sheet1!C122)","v":""},{"$f":"IF([1]Sheet1!D122=\"\",\"\",[1]Sheet1!D122)","v":""},0,"00",{"$f":"IF([1]Sheet1!G122=\"\",\"\",[1]Sheet1!G122)","v":""},{"$f":"IF([1]Sheet1!H122=\"\",\"\",[1]Sheet1!H122)","v":""},{"$f":"IF([1]Sheet1!I122=\"\",\"\",[1]Sheet1!I122)","v":""},{"$f":"IF([1]Sheet1!J122=\"\",\"\",[1]Sheet1!J122)","v":""},{"$f":"IF([1]Sheet1!K122=\"\",\"\",[1]Sheet1!K122)","v":""},{"$f":"IF([1]Sheet1!L122=\"\",\"\",[1]Sheet1!L122)","v":""}]
[{"$f":"IF([1]Sheet1!A123=\"\",\"\",[1]Sheet1!A123)","v":""},{"$f":"IF([1]Sheet1!B123=\"\",\"\",[1]Sheet1!B123)","v":""},{"$f":"IF([1]Sheet1!C123=\"\",\"\",[1]Sheet1!C123)","v":""},{"$f":"IF([1]Sheet1!D123=\"\",\"\",[1]Sheet1!D123)","v":""},0,"00",{"$f":"IF([1]Sheet1!G123=\"\",\"\",[1]Sheet1!G123)","v":""},{"$f":"IF([1]Sheet1!H123=\"\",\"\",[1]Sheet1!H123)","v":""},{"$f":"IF([1]Sheet1!I123=\"\",\"\",[1]Sheet1!I123)","v":""},{"$f":"IF([1]Sheet1!J123=\"\",\"\",[1]Sheet1!J123)","v":""},{"$f":"IF([1]Sheet1!K123=\"\",\"\",[1]Sheet1!K123)","v":""},{"$f":"IF([1]Sheet1!L123=\"\",\"\",[1]Sheet1!L123)","v":""}]
[{"$f":"IF([1]Sheet1!A124=\"\",\"\",[1]Sheet1!A124)","v":""},{"$f":"IF([1]Sheet1!B124=\"\",\"\",[1]Sheet1!B124)","v":""},{"$f":"IF([1]Sheet1!C124=\"\",\"\",[1]Sheet1!C124)","v":""},{"$f":"IF([1]Sheet1!D124=\"\",\"\",[1]Sheet1!D124)","v":""},0,"00",{"$f":"IF([1]Sheet1!G124=\"\",\"\",[1]Sheet1!G124)","v":""},{"$f":"IF([1]Sheet1!H124=\"\",\"\",[1]Sheet1!H124)","v":""},{"$f":"IF([1]Sheet1!I124=\"\",\"\",[1]Sheet1!I124)","v":""},{"$f":"IF([1]Sheet1!J124=\"\",\"\",[1]Sheet1!J124)","v":""},{"$f":"IF([1]Sheet1!K124=\"\",\"\",[1]Sheet1!K124)","v":""},{"$f":"IF([1]Sheet1!L124=\"\",\"\",[1]Sheet1!L124)","v":""}]
[{"$f":"IF([1]Sheet1!A125=\"\",\"\",[1]Sheet1!A125)","v":""},{"$f":"IF([1]Sheet1!B125=\"\",\"\",[1]Sheet1!B125)","v":""},{"$f":"IF([1]Sheet1!C125=\"\",\"\",[1]Sheet1!C125)","v":""},{"$f":"IF([1]Sheet1!D125=\"\",\"\",[1]Sheet1!D125)","v":""},0,"00",{"$f":"IF([1]Sheet1!G125=\"\",\"\",[1]Sheet1!G125)","v":""},{"$f":"IF([1]Sheet1!H125=\"\",\"\",[1]Sheet1!H125)","v":""},{"$f":"IF([1]Sheet1!I125=\"\",\"\",[1]Sheet1!I125)","v":""},{"$f":"IF([1]Sheet1!J125=\"\",\"\",[1]Sheet1!J125)","v":""},{"$f":"IF([1]Sheet1!K125=\"\",\"\",[1]Sheet1!K125)","v":""},{"$f":"IF([1]Sheet1!L125=\"\",\"\",[1]Sheet1!L125)","v":""}]
[{"$f":"IF([1]Sheet1!A126=\"\",\"\",[1]Sheet1!A126)","v":""},{"$f":"IF([1]Sheet1!B126=\"\",\"\",[1]Sheet1!B126)","v":""},{"$f":"IF([1]Sheet1!C126=\"\",\"\",[1]Sheet1!C126)","v":""},{"$f":"IF([1]Sheet1!D126=\"\",\"\",[1]Sheet1!D126)","v":""},0,"00",{"$f":"IF([1]Sheet1!G126=\"\",\"\",[1]Sheet1!G126)","v":""},{"$f":"IF([1]Sheet1!H126=\"\",\"\",[1]Sheet1!H126)","v":""},{"$f":"IF([1]Sheet1!I126=\"\",\"\",[1]Sheet1!I126)","v":""},{"$f":"IF([1]Sheet1!J126=\"\",\"\",[1]Sheet1!J126)","v":""},{"$f":"IF([1]Sheet1!K126=\"\",\"\",[1]Sheet1!K126)","v":""},{"$f":"IF([1]Sheet1!L126=\"\",\"\",[1]Sheet1!L126)","v":""}]
[{"$f":"IF([1]Sheet1!A127=\"\",\"\",[1]Sheet1!A127)","v":""},{"$f":"IF([1]Sheet1!B127=\"\",\"\",[1]Sheet1!B127)","v":""},{"$f":"IF([1]Sheet1!C127=\"\",\"\",[1]Sheet1!C127)","v":""},{"$f":"IF([1]Sheet1!D127=\"\",\"\",[1]Sheet1!D127)","v":""},0,"00",{"$f":"IF([1]Sheet1!G127=\"\",\"\",[1]Sheet1!G127)","v":""},{"$f":"IF([1]Sheet1!H127=\"\",\"\",[1]Sheet1!H127)","v":""},{"$f":"IF([1]Sheet1!I127=\"\",\"\",[1]Sheet1!I127)","v":""},{"$f":"IF([1]Sheet1!J127=\"\",\"\",[1]Sheet1!J127)","v":""},{"$f":"IF([1]Sheet1!K127=\"\",\"\",[1]Sheet1!K127)","v":""},{"$f":"IF([1]Sheet1!L127=\"\",\"\",[1]Sheet1!L127)","v":""}]
[{"$f":"IF([1]Sheet1!A128=\"\",\"\",[1]Sheet1!A128)","v":""},{"$f":"IF([1]Sheet1!B128=\"\",\"\",[1]Sheet1!B128)","v":""},{"$f":"IF([1]Sheet1!C128=\"\",\"\",[1]Sheet1!C128)","v":""},{"$f":"IF([1]Sheet1!D128=\"\",\"\",[1]Sheet1!D128)","v":""},0,"00",{"$f":"IF([1]Sheet1!G128=\"\",\"\",[1]Sheet1!G128)","v":""},{"$f":"IF([1]Sheet1!H128=\"\",\"\",[1]Sheet1!H128)","v":""},{"$f":"IF([1]Sheet1!I128=\"\",\"\",[1]Sheet1!I128)","v":""},{"$f":"IF([1]Sheet1!J128=\"\",\"\",[1]Sheet1!J128)","v":""},{"$f":"IF([1]Sheet1!K128=\"\",\"\",[1]Sheet1!K128)","v":""},{"$f":"IF([1]Sheet1!L128=\"\",\"\",[1]Sheet1!L128)","v":""}]
[{"$f":"IF([1]Sheet1!A129=\"\",\"\",[1]Sheet1!A129)","v":""},{"$f":"IF([1]Sheet1!B129=\"\",\"\",[1]Sheet1!B129)","v":""},{"$f":"IF([1]Sheet1!C129=\"\",\"\",[1]Sheet1!C129)","v":""},{"$f":"IF([1]Sheet1!D129=\"\",\"\",[1]Sheet1!D129)","v":""},0,"00",{"$f":"IF([1]Sheet1!G129=\"\",\"\",[1]Sheet1!G129)","v":""},{"$f":"IF([1]Sheet1!H129=\"\",\"\",[1]Sheet1!H129)","v":""},{"$f":"IF([1]Sheet1!I129=\"\",\"\",[1]Sheet1!I129)","v":""},{"$f":"IF([1]Sheet1!J129=\"\",\"\",[1]Sheet1!J129)","v":""},{"$f":"IF([1]Sheet1!K129=\"\",\"\",[1]Sheet1!K129)","v":""},{"$f":"IF([1]Sheet1!L129=\"\",\"\",[1]Sheet1!L129)","v":""}]
[{"$f":"IF([1]Sheet1!A130=\"\",\"\",[1]Sheet1!A130)","v":""},{"$f":"IF([1]Sheet1!B130=\"\",\"\",[1]Sheet1!B130)","v":""},{"$f":"IF([1]Sheet1!C130=\"\",\"\",[1]Sheet1!C130)","v":""},{"$f":"IF([1]Sheet1!D130=\"\",\"\",[1]Sheet1!D130)","v":""},0,"00",{"$f":"IF([1]Sheet1!G130=\"\",\"\",[1]Sheet1!G130)","v":""},{"$f":"IF([1]Sheet1!H130=\"\",\"\",[1]Sheet1!H130)","v":""},{"$f":"IF([1]Sheet1!I130=\"\",\"\",[1]Sheet1!I130)","v":""},{"$f":"IF([1]Sheet1!J130=\"\",\"\",[1]Sheet1!J130)","v":""},{"$f":"IF([1]Sheet1!K130=\"\",\"\",[1]Sheet1!K130)","v":""},{"$f":"IF([1]Sheet1!L130=\"\",\"\",[1]Sheet1!L130)","v":""}]
[{"$f":"IF([1]Sheet1!A131=\"\",\"\",[1]Sheet1!A131)","v":""},{"$f":"IF([1]Sheet1!B131=\"\",\"\",[1]Sheet1!B131)","v":""},{"$f":"IF([1]Sheet1!C131=\"\",\"\",[1]Sheet1!C131)","v":""},{"$f":"IF([1]Sheet1!D131=\"\",\"\",[1]Sheet1!D131)","v":""},0,"00",{"$f":"IF([1]Sheet1!G131=\"\",\"\",[1]Sheet1!G131)","v":""},{"$f":"IF([1]Sheet1!H131=\"\",\"\",[1]Sheet1!H131)","v":""},{"$f":"IF([1]Sheet1!I131=\"\",\"\",[1]Sheet1!I131)","v":""},{"$f":"IF([1]Sheet1!J131=\"\",\"\",[1]Sheet1!J131)","v":""},{"$f":"IF([1]Sheet1!K131=\"\",\"\",[1]Sheet1!K131)","v":""},{"$f":"IF([1]Sheet1!L131=\"\",\"\",[1]Sheet1!L131)","v":""}]
[{"$f":"IF([1]Sheet1!A132=\"\",\"\",[1]Sheet1!A132)","v":""},{"$f":"IF([1]Sheet1!B132=\"\",\"\",[1]Sheet1!B132)","v":""},{"$f":"IF([1]Sheet1!C132=\"\",\"\",[1]Sheet1!C132)","v":""},{"$f":"IF([1]Sheet1!D132=\"\",\"\",[1]Sheet1!D132)","v":""},0,"00",{"$f":"IF([1]Sheet1!G132=\"\",\"\",[1]Sheet1!G132)","v":""},{"$f":"IF([1]Sheet1!H132=\"\",\"\",[1]Sheet1!H132)","v":""},{"$f":"IF([1]Sheet1!I132=\"\",\"\",[1]Sheet1!I132)","v":""},{"$f":"IF([1]Sheet1!J132=\"\",\"\",[1]Sheet1!J132)","v":""},{"$f":"IF([1]Sheet1!K132=\"\",\"\",[1]Sheet1!K132)","v":""},{"$f":"IF([1]Sheet1!L132=\"\",\"\",[1]Sheet1!L132)","v":""}]
[{"$f":"IF([1]Sheet1!A133=\"\",\"\",[1]Sheet1!A133)","v":""},{"$f":"IF([1]Sheet1!B133=\"\",\"\",[1]Sheet1!B133)","v":""},{"$f":"IF([1]Sheet1!C133=\"\",\"\",[1]Sheet1!C133)","v":""},{"$f":"IF([1]Sheet1!D133=\"\",\"\",[1]Sheet1!D133)","v":""},0,"00",{"$f":"IF([1]Sheet1!G133=\"\",\"\",[1]Sheet1!G133)","v":""},{"$f":"IF([1]Sheet1!H133=\"\",\"\",[1]Sheet1!H133)","v":""},{"$f":"IF([1]Sheet1!I133=\"\",\"\",[1]Sheet1!I133)","v":""},{"$f":"IF([1]Sheet1!J133=\"\",\"\",[1]Sheet1!J133)","v":""},{"$f":"IF([1]Sheet1!K133=\"\",\"\",[1]Sheet1!K133)","v":""},{"$f":"IF([1]Sheet1!L133=\"\",\"\",[1]Sheet1!L133)","v":""}]
[{"$f":"IF([1]Sheet1!A134=\"\",\"\",[1]Sheet1!A134)","v":""},{"$f":"IF([1]Sheet1!B134=\"\",\"\",[1]Sheet1!B134)","v":""},{"$f":"IF([1]Sheet1!C134=\"\",\"\",[1]Sheet1!C134)","v":""},{"$f":"IF([1]Sheet1!D134=\"\",\"\",[1]Sheet1!D134)","v":""},0,"00",{"$f":"IF([1]Sheet1!G134=\"\",\"\",[1]Sheet1!G134)","v":""},{"$f":"IF([1]Sheet1!H134=\"\",\"\",[1]Sheet1!H134)","v":""},{"$f":"IF([1]Sheet1!I134=\"\",\"\",[1]Sheet1!I134)","v":""},{"$f":"IF([1]Sheet1!J134=\"\",\"\",[1]Sheet1!J134)","v":""},{"$f":"IF([1]Sheet1!K134=\"\",\"\",[1]Sheet1!K134)","v":""},{"$f":"IF([1]Sheet1!L134=\"\",\"\",[1]Sheet1!L134)","v":""}]
[{"$f":"IF([1]Sheet1!A135=\"\",\"\",[1]Sheet1!A135)","v":""},{"$f":"IF([1]Sheet1!B135=\"\",\"\",[1]Sheet1!B135)","v":""},{"$f":"IF([1]Sheet1!C135=\"\",\"\",[1]Sheet1!C135)","v":""},{"$f":"IF([1]Sheet1!D135=\"\",\"\",[1]Sheet1!D135)","v":""},0,"00",{"$f":"IF([1]Sheet1!G135=\"\",\"\",[1]Sheet1!G135)","v":""},{"$f":"IF([1]Sheet1!H135=\"\",\"\",[1]Sheet1!H135)","v":""},{"$f":"IF([1]Sheet1!I135=\"\",\"\",[1]Sheet1!I135)","v":""},{"$f":"IF([1]Sheet1!J135=\"\",\"\",[1]Sheet1!J135)","v":""},{"$f":"IF([1]Sheet1!K135=\"\",\"\",[1]Sheet1!K135)","v":""},{"$f":"IF([1]Sheet1!L135=\"\",\"\",[1]Sheet1!L135)","v":""}]
[{"$f":"IF([1]Sheet1!A136=\"\",\"\",[1]Sheet1!A136)","v":""},{"$f":"IF([1]Sheet1!B136=\"\",\"\",[1]Sheet1!B136)","v":""},{"$f":"IF([1]Sheet1!C136=\"\",\"\",[1]Sheet1!C136)","v":""},{"$f":"IF([1]Sheet1!D136=\"\",\"\",[1]Sheet1!D136)","v":""},0,"00",{"$f":"IF([1]Sheet1!G136=\"\",\"\",[1]Sheet1!G136)","v":""},{"$f":"IF([1]Sheet1!H136=\"\",\"\",[1]Sheet1!H136)","v":""},{"$f":"IF([1]Sheet1!I136=\"\",\"\",[1]Sheet1!I136)","v":""},{"$f":"IF([1]Sheet1!J136=\"\",\"\",[1]Sheet1!J136)","v":""},{"$f":"IF([1]Sheet1!K136=\"\",\"\",[1]Sheet1!K136)","v":""},{"$f":"IF([1]Sheet1!L136=\"\",\"\",[1]Sheet1!L136)","v":""}]
[{"$f":"IF([1]Sheet1!A137=\"\",\"\",[1]Sheet1!A137)","v":""},{"$f":"IF([1]Sheet1!B137=\"\",\"\",[1]Sheet1!B137)","v":""},{"$f":"IF([1]Sheet1!C137=\"\",\"\",[1]Sheet1!C137)","v":""},{"$f":"IF([1]Sheet1!D137=\"\",\"\",[1]Sheet1!D137)","v":""},0,"00",{"$f":"IF([1]Sheet1!G137=\"\",\"\",[1]Sheet1!G137)","v":""},{"$f":"IF([1]Sheet1!H137=\"\",\"\",[1]Sheet1!H137)","v":""},{"$f":"IF([1]Sheet1!I137=\"\",\"\",[1]Sheet1!I137)","v":""},{"$f":"IF([1]Sheet1!J137=\"\",\"\",[1]Sheet1!J137)","v":""},{"$f":"IF([1]Sheet1!K137=\"\",\"\",[1]Sheet1!K137)","v":""},{"$f":"IF([1]Sheet1!L137=\"\",\"\",[1]Sheet1!L137)","v":""}]
[{"$f":"IF([1]Sheet1!A138=\"\",\"\",[1]Sheet1!A138)","v":""},{"$f":"IF([1]Sheet1!B138=\"\",\"\",[1]Sheet1!B138)","v":""},{"$f":"IF([1]Sheet1!C138=\"\",\"\",[1]Sheet1!C138)","v":""},{"$f":"IF([1]Sheet1!D138=\"\",\"\",[1]Sheet1!D138)","v":""},0,"00",{"$f":"IF([1]Sheet1!G138=\"\",\"\",[1]Sheet1!G138)","v":""},{"$f":"IF([1]Sheet1!H138=\"\",\"\",[1]Sheet1!H138)","v":""},{"$f":"IF([1]Sheet1!I138=\"\",\"\",[1]Sheet1!I138)","v":""},{"$f":"IF([1]Sheet1!J138=\"\",\"\",[1]Sheet1!J138)","v":""},{"$f":"IF([1]Sheet1!K138=\"\",\"\",[1]Sheet1!K138)","v":""},{"$f":"IF([1]Sheet1!L138=\"\",\"\",[1]Sheet1!L138)","v":""}]
[{"$f":"IF([1]Sheet1!A139=\"\",\"\",[1]Sheet1!A139)","v":""},{"$f":"IF([1]Sheet1!B139=\"\",\"\",[1]Sheet1!B139)","v":""},{"$f":"IF([1]Sheet1!C139=\"\",\"\",[1]Sheet1!C139)","v":""},{"$f":"IF([1]Sheet1!D139=\"\",\"\",[1]Sheet1!D139)","v":""},0,"00",{"$f":"IF([1]Sheet1!G139=\"\",\"\",[1]Sheet1!G139)","v":""},{"$f":"IF([1]Sheet1!H139=\"\",\"\",[1]Sheet1!H139)","v":""},{"$f":"IF([1]Sheet1!I139=\"\",\"\",[1]Sheet1!I139)","v":""},{"$f":"IF([1]Sheet1!J139=\"\",\"\",[1]Sheet1!J139)","v":""},{"$f":"IF([1]Sheet1!K139=\"\",\"\",[1]Sheet1!K139)","v":""},{"$f":"IF([1]Sheet1!L139=\"\",\"\",[1]Sheet1!L139)","v":""}]
[{"$f":"IF([1]Sheet1!A140=\"\",\"\",[1]Sheet1!A140)","v":""},{"$f":"IF([1]Sheet1!B140=\"\",\"\",[1]Sheet1!B140)","v":""},{"$f":"IF([1]Sheet1!C140=\"\",\"\",[1]Sheet1!C140)","v":""},{"$f":"IF([1]Sheet1!D140=\"\",\"\",[1]Sheet1!D140)","v":""},0,"00",{"$f":"IF([1]Sheet1!G140=\"\",\"\",[1]Sheet1!G140)","v":""},{"$f":"IF([1]Sheet1!H140=\"\",\"\",[1]Sheet1!H140)","v":""},{"$f":"IF([1]Sheet1!I140=\"\",\"\",[1]Sheet1!I140)","v":""},{"$f":"IF([1]Sheet1!J140=\"\",\"\",[1]Sheet1!J140)","v":""},{"$f":"IF([1]Sheet1!K140=\"\",\"\",[1]Sheet1!K140)","v":""},{"$f":"IF([1]Sheet1!L140=\"\",\"\",[1]Sheet1!L140)","v":""}]
[{"$f":"IF([1]Sheet1!A141=\"\",\"\",[1]Sheet1!A141)","v":""},{"$f":"IF([1]Sheet1!B141=\"\",\"\",[1]Sheet1!B141)","v":""},{"$f":"IF([1]Sheet1!C141=\"\",\"\",[1]Sheet1!C141)","v":""},{"$f":"IF([1]Sheet1!D141=\"\",\"\",[1]Sheet1!D141)","v":""},0,"00",{"$f":"IF([1]Sheet1!G141=\"\",\"\",[1]Sheet1!G141)","v":""},{"$f":"IF([1]Sheet1!H141=\"\",\"\",[1]Sheet1!H141)","v":""},{"$f":"IF([1]Sheet1!I141=\"\",\"\",[1]Sheet1!I141)","v":""},{"$f":"IF([1]Sheet1!J141=\"\",\"\",[1]Sheet1!J141)","v":""},{"$f":"IF([1]Sheet1!K141=\"\",\"\",[1]Sheet1!K141)","v":""},{"$f":"IF([1]Sheet1!L141=\"\",\"\",[1]Sheet1!L141)","v":""}]
[{"$f":"IF([1]Sheet1!A142=\"\",\"\",[1]Sheet1!A142)","v":""},{"$f":"IF([1]Sheet1!B142=\"\",\"\",[1]Sheet1!B142)","v":""},{"$f":"IF([1]Sheet1!C142=\"\",\"\",[1]Sheet1!C142)","v":""},{"$f":"IF([1]Sheet1!D142=\"\",\"\",[1]Sheet1!D142)","v":""},0,"00",{"$f":"IF([1]Sheet1!G142=\"\",\"\",[1]Sheet1!G142)","v":""},{"$f":"IF([1]Sheet1!H142=\"\",\"\",[1]Sheet1!H142)","v":""},{"$f":"IF([1]Sheet1!I142=\"\",\"\",[1]Sheet1!I142)","v":""},{"$f":"IF([1]Sheet1!J142=\"\",\"\",[1]Sheet1!J142)","v":""},{"$f":"IF([1]Sheet1!K142=\"\",\"\",[1]Sheet1!K142)","v":""},{"$f":"IF([1]Sheet1!L142=\"\",\"\",[1]Sheet1!L142)","v":""}]
[{"$f":"IF([1]Sheet1!A143=\"\",\"\",[1]Sheet1!A143)","v":""},{"$f":"IF([1]Sheet1!B143=\"\",\"\",[1]Sheet1!B143)","v":""},{"$f":"IF([1]Sheet1!C143=\"\",\"\",[1]Sheet1!C143)","v":""},{"$f":"IF([1]Sheet1!D143=\"\",\"\",[1]Sheet1!D143)","v":""},0,"00",{"$f":"IF([1]Sheet1!G143=\"\",\"\",[1]Sheet1!G143)","v":""},{"$f":"IF([1]Sheet1!H143=\"\",\"\",[1]Sheet1!H143)","v":""},{"$f":"IF([1]Sheet1!I143=\"\",\"\",[1]Sheet1!I143)","v":""},{"$f":"IF([1]Sheet1!J143=\"\",\"\",[1]Sheet1!J143)","v":""},{"$f":"IF([1]Sheet1!K143=\"\",\"\",[1]Sheet1!K143)","v":""},{"$f":"IF([1]Sheet1!L143=\"\",\"\",[1]Sheet1!L143)","v":""}]
[{"$f":"IF([1]Sheet1!A144=\"\",\"\",[1]Sheet1!A144)","v":""},{"$f":"IF([1]Sheet1!B144=\"\",\"\",[1]Sheet1!B144)","v":""},{"$f":"IF([1]Sheet1!C144=\"\",\"\",[1]Sheet1!C144)","v":""},{"$f":"IF([1]Sheet1!D144=\"\",\"\",[1]Sheet1!D144)","v":""},{"$f":"IF([1]Sheet1!E144=\"\",\"\",[1]Sheet1!E144)","v":""},{"$f":"IF([1]Sheet1!F144=\"\",\"\",[1]Sheet1!F144)","v":""},{"$f":"IF([1]Sheet1!G144=\"\",\"\",[1]Sheet1!G144)","v":""},{"$f":"IF([1]Sheet1!H144=\"\",\"\",[1]Sheet1!H144)","v":""},{"$f":"IF([1]Sheet1!I144=\"\",\"\",[1]Sheet1!I144)","v":""},{"$f":"IF([1]Sheet1!J144=\"\",\"\",[1]Sheet1!J144)","v":""},{"$f":"IF([1]Sheet1!K144=\"\",\"\",[1]Sheet1!K144)","v":""},{"$f":"IF([1]Sheet1!L144=\"\",\"\",[1]Sheet1!L144)","v":""}]
[{"$f":"IF([1]Sheet1!A145=\"\",\"\",[1]Sheet1!A145)","v":""},{"$f":"IF([1]Sheet1!B145=\"\",\"\",[1]Sheet1!B145)","v":""},{"$f":"IF([1]Sheet1!C145=\"\",\"\",[1]Sheet1!C145)","v":""},{"$f":"IF([1]Sheet1!D145=\"\",\"\",[1]Sheet1!D145)","v":""},{"$f":"IF([1]Sheet1!E145=\"\",\"\",[1]Sheet1!E145)","v":""},{"$f":"IF([1]Sheet1!F145=\"\",\"\",[1]Sheet1!F145)","v":""},{"$f":"IF([1]Sheet1!G145=\"\",\"\",[1]Sheet1!G145)","v":""},{"$f":"IF([1]Sheet1!H145=\"\",\"\",[1]Sheet1!H145)","v":""},{"$f":"IF([1]Sheet1!I145=\"\",\"\",[1]Sheet1!I145)","v":""},{"$f":"IF([1]Sheet1!J145=\"\",\"\",[1]Sheet1!J145)","v":""},{"$f":"IF([1]Sheet1!K145=\"\",\"\",[1]Sheet1!K145)","v":""},{"$f":"IF([1]Sheet1!L145=\"\",\"\",[1]Sheet1!L145)","v":""}]
[{"$f":"IF([1]Sheet1!A146=\"\",\"\",[1]Sheet1!A146)","v":""},{"$f":"IF([1]Sheet1!B146=\"\",\"\",[1]Sheet1!B146)","v":""},{"$f":"IF([1]Sheet1!C146=\"\",\"\",[1]Sheet1!C146)","v":""},{"$f":"IF([1]Sheet1!D146=\"\",\"\",[1]Sheet1!D146)","v":""},{"$f":"IF([1]Sheet1!E146=\"\",\"\",[1]Sheet1!E146)","v":""},{"$f":"IF([1]Sheet1!F146=\"\",\"\",[1]Sheet1!F146)","v":""},{"$f":"IF([1]Sheet1!G146=\"\",\"\",[1]Sheet1!G146)","v":""},{"$f":"IF([1]Sheet1!H146=\"\",\"\",[1]Sheet1!H146)","v":""},{"$f":"IF([1]Sheet1!I146=\"\",\"\",[1]Sheet1!I146)","v":""},{"$f":"IF([1]Sheet1!J146=\"\",\"\",[1]Sheet1!J146)","v":""},{"$f":"IF([1]Sheet1!K146=\"\",\"\",[1]Sheet1!K146)","v":""},{"$f":"IF([1]Sheet1!L146=\"\",\"\",[1]Sheet1!L146)","v":""}]
[{"$f":"IF([1]Sheet1!A147=\"\",\"\",[1]Sheet1!A147)","v":""},{"$f":"IF([1]Sheet1!B147=\"\",\"\",[1]Sheet1!B147)","v":""},{"$f":"IF([1]Sheet1!C147=\"\",\"\",[1]Sheet1!C147)","v":""},{"$f":"IF([1]Sheet1!D147=\"\",\"\",[1]Sheet1!D147)","v":""},{"$f":"IF([1]Sheet1!E147=\"\",\"\",[1]Sheet1!E147)","v":""},{"$f":"IF([1]Sheet1!F147=\"\",\"\",[1]Sheet1!F147)","v":""},{"$f":"IF([1]Sheet1!G147=\"\",\"\",[1]Sheet1!G147)","v":""},{"$f":"IF([1]Sheet1!H147=\"\",\"\",[1]Sheet1!H147)","v":""},{"$f":"IF([1]Sheet1!I147=\"\",\"\",[1]Sheet1!I147)","v":""},{"$f":"IF([1]Sheet1!J147=\"\",\"\",[1]Sheet1!J147)","v":""},{"$f":"IF([1]Sheet1!K147=\"\",\"\",[1]Sheet1!K147)","v":""},{"$f":"IF([1]Sheet1!L147=\"\",\"\",[1]Sheet1!L147)","v":""}]
[{"$f":"IF([1]Sheet1!A148=\"\",\"\",[1]Sheet1!A148)","v":""},{"$f":"IF([1]Sheet1!B148=\"\",\"\",[1]Sheet1!B148)","v":""},{"$f":"IF([1]Sheet1!C148=\"\",\"\",[1]Sheet1!C148)","v":""},{"$f":"IF([1]Sheet1!D148=\"\",\"\",[1]Sheet1!D148)","v":""},{"$f":"IF([1]Sheet1!E148=\"\",\"\",[1]Sheet1!E148)","v":""},{"$f":"IF([1]Sheet1!F148=\"\",\"\",[1]Sheet1!F148)","v":""},{"$f":"IF([1]Sheet1!G148=\"\",\"\",[1]Sheet1!G148)","v":""},{"$f":"IF([1]Sheet1!H148=\"\",\"\",[1]Sheet1!H148)","v":""},{"$f":"IF([1]Sheet1!I148=\"\",\"\",[1]Sheet1!I148)","v":""},{"$f":"IF([1]Sheet1!J148=\"\",\"\",[1]Sheet1!J148)","v":""},{"$f":"IF([1]Sheet1!K148=\"\",\"\",[1]Sheet1!K148)","v":""},{"$f":"IF([1]Sheet1!L148=\"\",\"\",[1]Sheet1!L148)","v":""}]
[{"$f":"IF([1]Sheet1!A149=\"\",\"\",[1]Sheet1!A149)","v":""},{"$f":"IF([1]Sheet1!B149=\"\",\"\",[1]Sheet1!B149)","v":""},{"$f":"IF([1]Sheet1!C149=\"\",\"\",[1]Sheet1!C149)","v":""},{"$f":"IF([1]Sheet1!D149=\"\",\"\",[1]Sheet1!D149)","v":""},{"$f":"IF([1]Sheet1!E149=\"\",\"\",[1]Sheet1!E149)","v":""},{"$f":"IF([1]Sheet1!F149=\"\",\"\",[1]Sheet1!F149)","v":""},{"$f":"IF([1]Sheet1!G149=\"\",\"\",[1]Sheet1!G149)","v":""},{"$f":"IF([1]Sheet1!H149=\"\",\"\",[1]Sheet1!H149)","v":""},{"$f":"IF([1]Sheet1!I149=\"\",\"\",[1]Sheet1!I149)","v":""},{"$f":"IF([1]Sheet1!J149=\"\",\"\",[1]Sheet1!J149)","v":""},{"$f":"IF([1]Sheet1!K149=\"\",\"\",[1]Sheet1!K149)","v":""},{"$f":"IF([1]Sheet1!L149=\"\",\"\",[1]Sheet1!L149)","v":""}]
[{"$f":"IF([1]Sheet1!A150=\"\",\"\",[1]Sheet1!A150)","v":""},{"$f":"IF([1]Sheet1!B150=\"\",\"\",[1]Sheet1!B150)","v":""},{"$f":"IF([1]Sheet1!C150=\"\",\"\",[1]Sheet1!C150)","v":""},{"$f":"IF([1]Sheet1!D150=\"\",\"\",[1]Sheet1!D150)","v":""},{"$f":"IF([1]Sheet1!E150=\"\",\"\",[1]Sheet1!E150)","v":""},{"$f":"IF([1]Sheet1!F150=\"\",\"\",[1]Sheet1!F150)","v":""},{"$f":"IF([1]Sheet1!G150=\"\",\"\",[1]Sheet1!G150)","v":""},{"$f":"IF([1]Sheet1!H150=\"\",\"\",[1]Sheet1!H150)","v":""},{"$f":"IF([1]Sheet1!I150=\"\",\"\",[1]Sheet1!I150)","v":""},{"$f":"IF([1]Sheet1!J150=\"\",\"\",[1]Sheet1!J150)","v":""},{"$f":"IF([1]Sheet1!K150=\"\",\"\",[1]Sheet1!K150)","v":""},{"$f":"IF([1]Sheet1!L150=\"\",\"\",[1]Sheet1!L150)","v":""}]

{"sheet":"Arkusz1","index":2,"n_rows":200,"n_cols":9,"rows_kept":200}
["DATA","GODZINA",1,2,3,4,5,6,"PRACOWNIK"]
[{"$f":"'import danych'!A7","v":"2012-09-20"},{"$f":"'import danych'!B7","v":"13:24"},{"$f":"IF('import danych'!$I7=\"LINDE 01\",MAX(C$1:C1)+1,\"\")","v":2},{"$f":"IF('import danych'!$I7=\"LINDE 02\",MAX(D$1:D1)+1,\"\")","v":""},{"$f":"IF('import danych'!$I7=\"LINDE 03\",MAX(E$1:E1)+1,\"\")","v":""},{"$f":"IF('import danych'!$I7=\"YALE 04\",MAX(F$1:F1)+1,\"\")","v":""},{"$f":"IF('import danych'!$I7=\"SUR\",MAX(G$1:G1)+1,\"\")","v":""},{"$f":"IF('import danych'!$I7=\"SMP\",MAX(H$1:H1)+1,\"\")","v":""},"TEST 1"]
[{"$f":"'import danych'!A8","v":"2012-09-21"},{"$f":"'import danych'!B8","v":"13:04"},{"$f":"IF('import danych'!$I8=\"LINDE 01\",MAX(C$1:C2)+1,\"\")","v":""},{"$f":"IF('import danych'!$I8=\"LINDE 02\",MAX(D$1:D2)+1,\"\")","v":""},{"$f":"IF('import danych'!$I8=\"LINDE 03\",MAX(E$1:E2)+1,\"\")","v":4},{"$f":"IF('import danych'!$I8=\"YALE 04\",MAX(F$1:F2)+1,\"\")","v":""},{"$f":"IF('import danych'!$I8=\"SUR\",MAX(G$1:G2)+1,\"\")","v":""},{"$f":"IF('import danych'!$I8=\"SMP\",MAX(H$1:H2)+1,\"\")","v":""},{"$f":"IF('import danych'!E8=\"\",\"\",LOOKUP('import danych'!F8,#REF!,#REF!))","v":{"$error":"#REF!"}}]
[{"$f":"'import danych'!A9","v":"2012-09-21"},{"$f":"'import danych'!B9","v":"13:08"},{"$f":"IF('import danych'!$I9=\"LINDE 01\",MAX(C$1:C3)+1,\"\")","v":3},{"$f":"IF('import danych'!$I9=\"LINDE 02\",MAX(D$1:D3)+1,\"\")","v":""},{"$f":"IF('import danych'!$I9=\"LINDE 03\",MAX(E$1:E3)+1,\"\")","v":""},{"$f":"IF('import danych'!$I9=\"YALE 04\",MAX(F$1:F3)+1,\"\")","v":""},{"$f":"IF('import danych'!$I9=\"SUR\",MAX(G$1:G3)+1,\"\")","v":""},{"$f":"IF('import danych'!$I9=\"SMP\",MAX(H$1:H3)+1,\"\")","v":""},{"$f":"IF('import danych'!E9=\"\",\"\",LOOKUP('import danych'!F9,#REF!,#REF!))","v":{"$error":"#REF!"}}]
[{"$f":"'import danych'!A10","v":"2012-09-21"},{"$f":"'import danych'!B10","v":"13:13"},{"$f":"IF('import danych'!$I10=\"LINDE 01\",MAX(C$1:C4)+1,\"\")","v":""},{"$f":"IF('import danych'!$I10=\"LINDE 02\",MAX(D$1:D4)+1,\"\")","v":3},{"$f":"IF('import danych'!$I10=\"LINDE 03\",MAX(E$1:E4)+1,\"\")","v":""},{"$f":"IF('import danych'!$I10=\"YALE 04\",MAX(F$1:F4)+1,\"\")","v":""},{"$f":"IF('import danych'!$I10=\"SUR\",MAX(G$1:G4)+1,\"\")","v":""},{"$f":"IF('import danych'!$I10=\"SMP\",MAX(H$1:H4)+1,\"\")","v":""},{"$f":"IF('import danych'!E10=\"\",\"\",LOOKUP('import danych'!F10,#REF!,#REF!))","v":{"$error":"#REF!"}}]
[{"$f":"'import danych'!A11","v":"2012-09-22"},{"$f":"'import danych'!B11","v":"12:54"},{"$f":"IF('import danych'!$I11=\"LINDE 01\",MAX(C$1:C5)+1,\"\")","v":4},{"$f":"IF('import danych'!$I11=\"LINDE 02\",MAX(D$1:D5)+1,\"\")","v":""},{"$f":"IF('import danych'!$I11=\"LINDE 03\",MAX(E$1:E5)+1,\"\")","v":""},{"$f":"IF('import danych'!$I11=\"YALE 04\",MAX(F$1:F5)+1,\"\")","v":""},{"$f":"IF('import danych'!$I11=\"SUR\",MAX(G$1:G5)+1,\"\")","v":""},{"$f":"IF('import danych'!$I11=\"SMP\",MAX(H$1:H5)+1,\"\")","v":""},{"$f":"IF('import danych'!E11=\"\",\"\",LOOKUP('import danych'!F11,#REF!,#REF!))","v":{"$error":"#REF!"}}]
[{"$f":"'import danych'!A12","v":"2012-09-22"},{"$f":"'import danych'!B12","v":"12:57"},{"$f":"IF('import danych'!$I12=\"LINDE 01\",MAX(C$1:C6)+1,\"\")","v":""},{"$f":"IF('import danych'!$I12=\"LINDE 02\",MAX(D$1:D6)+1,\"\")","v":4},{"$f":"IF('import danych'!$I12=\"LINDE 03\",MAX(E$1:E6)+1,\"\")","v":""},{"$f":"IF('import danych'!$I12=\"YALE 04\",MAX(F$1:F6)+1,\"\")","v":""},{"$f":"IF('import danych'!$I12=\"SUR\",MAX(G$1:G6)+1,\"\")","v":""},{"$f":"IF('import danych'!$I12=\"SMP\",MAX(H$1:H6)+1,\"\")","v":""},{"$f":"IF('import danych'!E12=\"\",\"\",LOOKUP('import danych'!F12,#REF!,#REF!))","v":{"$error":"#REF!"}}]
[{"$f":"'import danych'!A13","v":"2012-09-22"},{"$f":"'import danych'!B13","v":"13:03"},{"$f":"IF('import danych'!$I13=\"LINDE 01\",MAX(C$1:C7)+1,\"\")","v":""},{"$f":"IF('import danych'!$I13=\"LINDE 02\",MAX(D$1:D7)+1,\"\")","v":""},{"$f":"IF('import danych'!$I13=\"LINDE 03\",MAX(E$1:E7)+1,\"\")","v":5},{"$f":"IF('import danych'!$I13=\"YALE 04\",MAX(F$1:F7)+1,\"\")","v":""},{"$f":"IF('import danych'!$I13=\"SUR\",MAX(G$1:G7)+1,\"\")","v":""},{"$f":"IF('import danych'!$I13=\"SMP\",MAX(H$1:H7)+1,\"\")","v":""},{"$f":"IF('import danych'!E13=\"\",\"\",LOOKUP('import danych'!F13,#REF!,#REF!))","v":{"$error":"#REF!"}}]
[{"$f":"'import danych'!A14","v":"2012-09-24"},{"$f":"'import danych'!B14","v":"12:31"},{"$f":"IF('import danych'!$I14=\"LINDE 01\",MAX(C$1:C8)+1,\"\")","v":""},{"$f":"IF('import danych'!$I14=\"LINDE 02\",MAX(D$1:D8)+1,\"\")","v":5},{"$f":"IF('import danych'!$I14=\"LINDE 03\",MAX(E$1:E8)+1,\"\")","v":""},{"$f":"IF('import danych'!$I14=\"YALE 04\",MAX(F$1:F8)+1,\"\")","v":""},{"$f":"IF('import danych'!$I14=\"SUR\",MAX(G$1:G8)+1,\"\")","v":""},{"$f":"IF('import danych'!$I14=\"SMP\",MAX(H$1:H8)+1,\"\")","v":""},{"$f":"IF('import danych'!E14=\"\",\"\",LOOKUP('import danych'!F14,#REF!,#REF!))","v":{"$error":"#REF!"}}]
[{"$f":"'import danych'!A15","v":"2012-09-24"},{"$f":"'import danych'!B15","v":"12:36"},{"$f":"IF('import danych'!$I15=\"LINDE 01\",MAX(C$1:C9)+1,\"\")","v":5},{"$f":"IF('import danych'!$I15=\"LINDE 02\",MAX(D$1:D9)+1,\"\")","v":""},{"$f":"IF('import danych'!$I15=\"LINDE 03\",MAX(E$1:E9)+1,\"\")","v":""},{"$f":"IF('import danych'!$I15=\"YALE 04\",MAX(F$1:F9)+1,\"\")","v":""},{"$f":"IF('import danych'!$I15=\"SUR\",MAX(G$1:G9)+1,\"\")","v":""},{"$f":"IF('import danych'!$I15=\"SMP\",MAX(H$1:H9)+1,\"\")","v":""},{"$f":"IF('import danych'!E15=\"\",\"\",LOOKUP('import danych'!F15,#REF!,#REF!))","v":{"$error":"#REF!"}}]
[{"$f":"'import danych'!A16","v":"2012-09-25"},{"$f":"'import danych'!B16","v":"08:53"},{"$f":"IF('import danych'!$I16=\"LINDE 01\",MAX(C$1:C10)+1,\"\")","v":6},{"$f":"IF('import danych'!$I16=\"LINDE 02\",MAX(D$1:D10)+1,\"\")","v":""},{"$f":"IF('import danych'!$I16=\"LINDE 03\",MAX(E$1:E10)+1,\"\")","v":""},{"$f":"IF('import danych'!$I16=\"YALE 04\",MAX(F$1:F10)+1,\"\")","v":""},{"$f":"IF('import danych'!$I16=\"SUR\",MAX(G$1:G10)+1,\"\")","v":""},{"$f":"IF('import danych'!$I16=\"SMP\",MAX(H$1:H10)+1,\"\")","v":""},{"$f":"IF('import danych'!E16=\"\",\"\",LOOKUP('import danych'!F16,#REF!,#REF!))","v":{"$error":"#REF!"}}]
[{"$f":"'import danych'!A17","v":"2012-09-25"},{"$f":"'import danych'!B17","v":"08:56"},{"$f":"IF('import danych'!$I17=\"LINDE 01\",MAX(C$1:C11)+1,\"\")","v":""},{"$f":"IF('import danych'!$I17=\"LINDE 02\",MAX(D$1:D11)+1,\"\")","v":6},{"$f":"IF('import danych'!$I17=\"LINDE 03\",MAX(E$1:E11)+1,\"\")","v":""},{"$f":"IF('import danych'!$I17=\"YALE 04\",MAX(F$1:F11)+1,\"\")","v":""},{"$f":"IF('import danych'!$I17=\"SUR\",MAX(G$1:G11)+1,\"\")","v":""},{"$f":"IF('import danych'!$I17=\"SMP\",MAX(H$1:H11)+1,\"\")","v":""},{"$f":"IF('import danych'!E17=\"\",\"\",LOOKUP('import danych'!F17,#REF!,#REF!))","v":{"$error":"#REF!"}}]
[{"$f":"'import danych'!A18","v":"2012-09-25"},{"$f":"'import danych'!B18","v":"10:25"},{"$f":"IF('import danych'!$I18=\"LINDE 01\",MAX(C$1:C12)+1,\"\")","v":""},{"$f":"IF('import danych'!$I18=\"LINDE 02\",MAX(D$1:D12)+1,\"\")","v":""},{"$f":"IF('import danych'!$I18=\"LINDE 03\",MAX(E$1:E12)+1,\"\")","v":6},{"$f":"IF('import danych'!$I18=\"YALE 04\",MAX(F$1:F12)+1,\"\")","v":""},{"$f":"IF('import danych'!$I18=\"SUR\",MAX(G$1:G12)+1,\"\")","v":""},{"$f":"IF('import danych'!$I18=\"SMP\",MAX(H$1:H12)+1,\"\")","v":""},{"$f":"IF('import danych'!E18=\"\",\"\",LOOKUP('import danych'!F18,#REF!,#REF!))","v":{"$error":"#REF!"}}]
[{"$f":"'import danych'!A19","v":"2012-09-26"},{"$f":"'import danych'!B19","v":"09:33"},{"$f":"IF('import danych'!$I19=\"LINDE 01\",MAX(C$1:C13)+1,\"\")","v":""},{"$f":"IF('import danych'!$I19=\"LINDE 02\",MAX(D$1:D13)+1,\"\")","v":7},{"$f":"IF('import danych'!$I19=\"LINDE 03\",MAX(E$1:E13)+1,\"\")","v":""},{"$f":"IF('import danych'!$I19=\"YALE 04\",MAX(F$1:F13)+1,\"\")","v":""},{"$f":"IF('import danych'!$I19=\"SUR\",MAX(G$1:G13)+1,\"\")","v":""},{"$f":"IF('import danych'!$I19=\"SMP\",MAX(H$1:H13)+1,\"\")","v":""},{"$f":"IF('import danych'!E19=\"\",\"\",LOOKUP('import danych'!F19,#REF!,#REF!))","v":{"$error":"#REF!"}}]
[{"$f":"'import danych'!A20","v":"2012-09-26"},{"$f":"'import danych'!B20","v":"09:36"},{"$f":"IF('import danych'!$I20=\"LINDE 01\",MAX(C$1:C14)+1,\"\")","v":7},{"$f":"IF('import danych'!$I20=\"LINDE 02\",MAX(D$1:D14)+1,\"\")","v":""},{"$f":"IF('import danych'!$I20=\"LINDE 03\",MAX(E$1:E14)+1,\"\")","v":""},{"$f":"IF('import danych'!$I20=\"YALE 04\",MAX(F$1:F14)+1,\"\")","v":""},{"$f":"IF('import danych'!$I20=\"SUR\",MAX(G$1:G14)+1,\"\")","v":""},{"$f":"IF('import danych'!$I20=\"SMP\",MAX(H$1:H14)+1,\"\")","v":""},{"$f":"IF('import danych'!E20=\"\",\"\",LOOKUP('import danych'!F20,#REF!,#REF!))","v":{"$error":"#REF!"}}]
[{"$f":"'import danych'!A21","v":"2012-09-27"},{"$f":"'import danych'!B21","v":"07:18"},{"$f":"IF('import danych'!$I21=\"LINDE 01\",MAX(C$1:C15)+1,\"\")","v":""},{"$f":"IF('import danych'!$I21=\"LINDE 02\",MAX(D$1:D15)+1,\"\")","v":8},{"$f":"IF('import danych'!$I21=\"LINDE 03\",MAX(E$1:E15)+1,\"\")","v":""},{"$f":"IF('import danych'!$I21=\"YALE 04\",MAX(F$1:F15)+1,\"\")","v":""},{"$f":"IF('import danych'!$I21=\"SUR\",MAX(G$1:G15)+1,\"\")","v":""},{"$f":"IF('import danych'!$I21=\"SMP\",MAX(H$1:H15)+1,\"\")","v":""},{"$f":"IF('import danych'!E21=\"\",\"\",LOOKUP('import danych'!F21,#REF!,#REF!))","v":{"$error":"#REF!"}}]
[{"$f":"'import danych'!A22","v":"2012-09-27"},{"$f":"'import danych'!B22","v":"11:32"},{"$f":"IF('import danych'!$I22=\"LINDE 01\",MAX(C$1:C16)+1,\"\")","v":8},{"$f":"IF('import danych'!$I22=\"LINDE 02\",MAX(D$1:D16)+1,\"\")","v":""},{"$f":"IF('import danych'!$I22=\"LINDE 03\",MAX(E$1:E16)+1,\"\")","v":""},{"$f":"IF('import danych'!$I22=\"YALE 04\",MAX(F$1:F16)+1,\"\")","v":""},{"$f":"IF('import danych'!$I22=\"SUR\",MAX(G$1:G16)+1,\"\")","v":""},{"$f":"IF('import danych'!$I22=\"SMP\",MAX(H$1:H16)+1,\"\")","v":""},{"$f":"IF('import danych'!E22=\"\",\"\",LOOKUP('import danych'!F22,#REF!,#REF!))","v":{"$error":"#REF!"}}]
[{"$f":"'import danych'!A23","v":"2012-09-27"},{"$f":"'import danych'!B23","v":"13:01"},{"$f":"IF('import danych'!$I23=\"LINDE 01\",MAX(C$1:C17)+1,\"\")","v":""},{"$f":"IF('import danych'!$I23=\"LINDE 02\",MAX(D$1:D17)+1,\"\")","v":""},{"$f":"IF('import danych'!$I23=\"LINDE 03\",MAX(E$1:E17)+1,\"\")","v":7},{"$f":"IF('import danych'!$I23=\"YALE 04\",MAX(F$1:F17)+1,\"\")","v":""},{"$f":"IF('import danych'!$I23=\"SUR\",MAX(G$1:G17)+1,\"\")","v":""},{"$f":"IF('import danych'!$I23=\"SMP\",MAX(H$1:H17)+1,\"\")","v":""},{"$f":"IF('import danych'!E23=\"\",\"\",LOOKUP('import danych'!F23,#REF!,#REF!))","v":{"$error":"#REF!"}}]
[{"$f":"'import danych'!A24","v":"2012-09-28"},{"$f":"'import danych'!B24","v":"10:11"},{"$f":"IF('import danych'!$I24=\"LINDE 01\",MAX(C$1:C18)+1,\"\")","v":9},{"$f":"IF('import danych'!$I24=\"LINDE 02\",MAX(D$1:D18)+1,\"\")","v":""},{"$f":"IF('import danych'!$I24=\"LINDE 03\",MAX(E$1:E18)+1,\"\")","v":""},{"$f":"IF('import danych'!$I24=\"YALE 04\",MAX(F$1:F18)+1,\"\")","v":""},{"$f":"IF('import danych'!$I24=\"SUR\",MAX(G$1:G18)+1,\"\")","v":""},{"$f":"IF('import danych'!$I24=\"SMP\",MAX(H$1:H18)+1,\"\")","v":""},{"$f":"IF('import danych'!E24=\"\",\"\",LOOKUP('import danych'!F24,#REF!,#REF!))","v":{"$error":"#REF!"}}]
[{"$f":"'import danych'!A25","v":"2012-09-28"},{"$f":"'import danych'!B25","v":"11:10"},{"$f":"IF('import danych'!$I25=\"LINDE 01\",MAX(C$1:C19)+1,\"\")","v":""},{"$f":"IF('import danych'!$I25=\"LINDE 02\",MAX(D$1:D19)+1,\"\")","v":9},{"$f":"IF('import danych'!$I25=\"LINDE 03\",MAX(E$1:E19)+1,\"\")","v":""},{"$f":"IF('import danych'!$I25=\"YALE 04\",MAX(F$1:F19)+1,\"\")","v":""},{"$f":"IF('import danych'!$I25=\"SUR\",MAX(G$1:G19)+1,\"\")","v":""},{"$f":"IF('import danych'!$I25=\"SMP\",MAX(H$1:H19)+1,\"\")","v":""},{"$f":"IF('import danych'!E25=\"\",\"\",LOOKUP('import danych'!F25,#REF!,#REF!))","v":{"$error":"#REF!"}}]
[{"$f":"'import danych'!A26","v":"2012-09-30"},{"$f":"'import danych'!B26","v":"07:30"},{"$f":"IF('import danych'!$I26=\"LINDE 01\",MAX(C$1:C20)+1,\"\")","v":""},{"$f":"IF('import danych'!$I26=\"LINDE 02\",MAX(D$1:D20)+1,\"\")","v":""},{"$f":"IF('import danych'!$I26=\"LINDE 03\",MAX(E$1:E20)+1,\"\")","v":8},{"$f":"IF('import danych'!$I26=\"YALE 04\",MAX(F$1:F20)+1,\"\")","v":""},{"$f":"IF('import danych'!$I26=\"SUR\",MAX(G$1:G20)+1,\"\")","v":""},{"$f":"IF('import danych'!$I26=\"SMP\",MAX(H$1:H20)+1,\"\")","v":""},{"$f":"IF('import danych'!E26=\"\",\"\",LOOKUP('import danych'!F26,#REF!,#REF!))","v":{"$error":"#REF!"}}]
[{"$f":"'import danych'!A27","v":"2012-09-30"},{"$f":"'import danych'!B27","v":"08:45"},{"$f":"IF('import danych'!$I27=\"LINDE 01\",MAX(C$1:C21)+1,\"\")","v":10},{"$f":"IF('import danych'!$I27=\"LINDE 02\",MAX(D$1:D21)+1,\"\")","v":""},{"$f":"IF('import danych'!$I27=\"LINDE 03\",MAX(E$1:E21)+1,\"\")","v":""},{"$f":"IF('import danych'!$I27=\"YALE 04\",MAX(F$1:F21)+1,\"\")","v":""},{"$f":"IF('import danych'!$I27=\"SUR\",MAX(G$1:G21)+1,\"\")","v":""},{"$f":"IF('import danych'!$I27=\"SMP\",MAX(H$1:H21)+1,\"\")","v":""},{"$f":"IF('import danych'!E27=\"\",\"\",LOOKUP('import danych'!F27,#REF!,#REF!))","v":{"$error":"#REF!"}}]
[{"$f":"'import danych'!A28","v":"2012-09-30"},{"$f":"'import danych'!B28","v":"10:21"},{"$f":"IF('import danych'!$I28=\"LINDE 01\",MAX(C$1:C22)+1,\"\")","v":""},{"$f":"IF('import danych'!$I28=\"LINDE 02\",MAX(D$1:D22)+1,\"\")","v":10},{"$f":"IF('import danych'!$I28=\"LINDE 03\",MAX(E$1:E22)+1,\"\")","v":""},{"$f":"IF('import danych'!$I28=\"YALE 04\",MAX(F$1:F22)+1,\"\")","v":""},{"$f":"IF('import danych'!$I28=\"SUR\",MAX(G$1:G22)+1,\"\")","v":""},{"$f":"IF('import danych'!$I28=\"SMP\",MAX(H$1:H22)+1,\"\")","v":""},{"$f":"IF('import danych'!E28=\"\",\"\",LOOKUP('import danych'!F28,#REF!,#REF!))","v":{"$error":"#REF!"}}]
[{"$f":"'import danych'!A29","v":"2012-10-01"},{"$f":"'import danych'!B29","v":"18:54"},{"$f":"IF('import danych'!$I29=\"LINDE 01\",MAX(C$1:C23)+1,\"\")","v":""},{"$f":"IF('import danych'!$I29=\"LINDE 02\",MAX(D$1:D23)+1,\"\")","v":11},{"$f":"IF('import danych'!$I29=\"LINDE 03\",MAX(E$1:E23)+1,\"\")","v":""},{"$f":"IF('import danych'!$I29=\"YALE 04\",MAX(F$1:F23)+1,\"\")","v":""},{"$f":"IF('import danych'!$I29=\"SUR\",MAX(G$1:G23)+1,\"\")","v":""},{"$f":"IF('import danych'!$I29=\"SMP\",MAX(H$1:H23)+1,\"\")","v":""},{"$f":"IF('import danych'!E29=\"\",\"\",LOOKUP('import danych'!F29,#REF!,#REF!))","v":{"$error":"#REF!"}}]
[{"$f":"'import danych'!A30","v":"2012-10-01"},{"$f":"'import danych'!B30","v":"18:56"},{"$f":"IF('import danych'!$I30=\"LINDE 01\",MAX(C$1:C24)+1,\"\")","v":11},{"$f":"IF('import danych'!$I30=\"LINDE 02\",MAX(D$1:D24)+1,\"\")","v":""},{"$f":"IF('import danych'!$I30=\"LINDE 03\",MAX(E$1:E24)+1,\"\")","v":""},{"$f":"IF('import danych'!$I30=\"YALE 04\",MAX(F$1:F24)+1,\"\")","v":""},{"$f":"IF('import danych'!$I30=\"SUR\",MAX(G$1:G24)+1,\"\")","v":""},{"$f":"IF('import danych'!$I30=\"SMP\",MAX(H$1:H24)+1,\"\")","v":""},{"$f":"IF('import danych'!E30=\"\",\"\",LOOKUP('import danych'!F30,#REF!,#REF!))","v":{"$error":"#REF!"}}]
[{"$f":"'import danych'!A31","v":"2012-10-02"},{"$f":"'import danych'!B31","v":"11:05"},{"$f":"IF('import danych'!$I31=\"LINDE 01\",MAX(C$1:C25)+1,\"\")","v":""},{"$f":"IF('import danych'!$I31=\"LINDE 02\",MAX(D$1:D25)+1,\"\")","v":""},{"$f":"IF('import danych'!$I31=\"LINDE 03\",MAX(E$1:E25)+1,\"\")","v":9},{"$f":"IF('import danych'!$I31=\"YALE 04\",MAX(F$1:F25)+1,\"\")","v":""},{"$f":"IF('import danych'!$I31=\"SUR\",MAX(G$1:G25)+1,\"\")","v":""},{"$f":"IF('import danych'!$I31=\"SMP\",MAX(H$1:H25)+1,\"\")","v":""},{"$f":"IF('import danych'!E31=\"\",\"\",LOOKUP('import danych'!F31,#REF!,#REF!))","v":{"$error":"#REF!"}}]
[{"$f":"'import danych'!A32","v":"2012-10-02"},{"$f":"'import danych'!B32","v":"12:59"},{"$f":"IF('import danych'!$I32=\"LINDE 01\",MAX(C$1:C26)+1,\"\")","v":""},{"$f":"IF('import danych'!$I32=\"LINDE 02\",MAX(D$1:D26)+1,\"\")","v":12},{"$f":"IF('import danych'!$I32=\"LINDE 03\",MAX(E$1:E26)+1,\"\")","v":""},{"$f":"IF('import danych'!$I32=\"YALE 04\",MAX(F$1:F26)+1,\"\")","v":""},{"$f":"IF('import danych'!$I32=\"SUR\",MAX(G$1:G26)+1,\"\")","v":""},{"$f":"IF('import danych'!$I32=\"SMP\",MAX(H$1:H26)+1,\"\")","v":""},{"$f":"IF('import danych'!E32=\"\",\"\",LOOKUP('import danych'!F32,#REF!,#REF!))","v":{"$error":"#REF!"}}]
[{"$f":"'import danych'!A33","v":"2012-10-02"},{"$f":"'import danych'!B33","v":"13:02"},{"$f":"IF('import danych'!$I33=\"LINDE 01\",MAX(C$1:C27)+1,\"\")","v":12},{"$f":"IF('import danych'!$I33=\"LINDE 02\",MAX(D$1:D27)+1,\"\")","v":""},{"$f":"IF('import danych'!$I33=\"LINDE 03\",MAX(E$1:E27)+1,\"\")","v":""},{"$f":"IF('import danych'!$I33=\"YALE 04\",MAX(F$1:F27)+1,\"\")","v":""},{"$f":"IF('import danych'!$I33=\"SUR\",MAX(G$1:G27)+1,\"\")","v":""},{"$f":"IF('import danych'!$I33=\"SMP\",MAX(H$1:H27)+1,\"\")","v":""},{"$f":"IF('import danych'!E33=\"\",\"\",LOOKUP('import danych'!F33,#REF!,#REF!))","v":{"$error":"#REF!"}}]
[{"$f":"'import danych'!A34","v":"2012-10-03"},{"$f":"'import danych'!B34","v":"13:08"},{"$f":"IF('import danych'!$I34=\"LINDE 01\",MAX(C$1:C28)+1,\"\")","v":""},{"$f":"IF('import danych'!$I34=\"LINDE 02\",MAX(D$1:D28)+1,\"\")","v":13},{"$f":"IF('import danych'!$I34=\"LINDE 03\",MAX(E$1:E28)+1,\"\")","v":""},{"$f":"IF('import danych'!$I34=\"YALE 04\",MAX(F$1:F28)+1,\"\")","v":""},{"$f":"IF('import danych'!$I34=\"SUR\",MAX(G$1:G28)+1,\"\")","v":""},{"$f":"IF('import danych'!$I34=\"SMP\",MAX(H$1:H28)+1,\"\")","v":""},{"$f":"IF('import danych'!E34=\"\",\"\",LOOKUP('import danych'!F34,#REF!,#REF!))","v":{"$error":"#REF!"}}]
[{"$f":"'import danych'!A35","v":"2012-10-03"},{"$f":"'import danych'!B35","v":"13:15"},{"$f":"IF('import danych'!$I35=\"LINDE 01\",MAX(C$1:C29)+1,\"\")","v":13},{"$f":"IF('import danych'!$I35=\"LINDE 02\",MAX(D$1:D29)+1,\"\")","v":""},{"$f":"IF('import danych'!$I35=\"LINDE 03\",MAX(E$1:E29)+1,\"\")","v":""},{"$f":"IF('import danych'!$I35=\"YALE 04\",MAX(F$1:F29)+1,\"\")","v":""},{"$f":"IF('import danych'!$I35=\"SUR\",MAX(G$1:G29)+1,\"\")","v":""},{"$f":"IF('import danych'!$I35=\"SMP\",MAX(H$1:H29)+1,\"\")","v":""},{"$f":"IF('import danych'!E35=\"\",\"\",LOOKUP('import danych'!F35,#REF!,#REF!))","v":{"$error":"#REF!"}}]
[{"$f":"'import danych'!A36","v":"2012-10-04"},{"$f":"'import danych'!B36","v":"00:46"},{"$f":"IF('import danych'!$I36=\"LINDE 01\",MAX(C$1:C30)+1,\"\")","v":""},{"$f":"IF('import danych'!$I36=\"LINDE 02\",MAX(D$1:D30)+1,\"\")","v":""},{"$f":"IF('import danych'!$I36=\"LINDE 03\",MAX(E$1:E30)+1,\"\")","v":10},{"$f":"IF('import danych'!$I36=\"YALE 04\",MAX(F$1:F30)+1,\"\")","v":""},{"$f":"IF('import danych'!$I36=\"SUR\",MAX(G$1:G30)+1,\"\")","v":""},{"$f":"IF('import danych'!$I36=\"SMP\",MAX(H$1:H30)+1,\"\")","v":""},{"$f":"IF('import danych'!E36=\"\",\"\",LOOKUP('import danych'!F36,#REF!,#REF!))","v":{"$error":"#REF!"}}]
[{"$f":"'import danych'!A37","v":"2012-10-04"},{"$f":"'import danych'!B37","v":"13:06"},{"$f":"IF('import danych'!$I37=\"LINDE 01\",MAX(C$1:C31)+1,\"\")","v":""},{"$f":"IF('import danych'!$I37=\"LINDE 02\",MAX(D$1:D31)+1,\"\")","v":14},{"$f":"IF('import danych'!$I37=\"LINDE 03\",MAX(E$1:E31)+1,\"\")","v":""},{"$f":"IF('import danych'!$I37=\"YALE 04\",MAX(F$1:F31)+1,\"\")","v":""},{"$f":"IF('import danych'!$I37=\"SUR\",MAX(G$1:G31)+1,\"\")","v":""},{"$f":"IF('import danych'!$I37=\"SMP\",MAX(H$1:H31)+1,\"\")","v":""},{"$f":"IF('import danych'!E37=\"\",\"\",LOOKUP('import danych'!F37,#REF!,#REF!))","v":{"$error":"#REF!"}}]
[{"$f":"'import danych'!A38","v":"2012-10-04"},{"$f":"'import danych'!B38","v":"13:21"},{"$f":"IF('import danych'!$I38=\"LINDE 01\",MAX(C$1:C32)+1,\"\")","v":14},{"$f":"IF('import danych'!$I38=\"LINDE 02\",MAX(D$1:D32)+1,\"\")","v":""},{"$f":"IF('import danych'!$I38=\"LINDE 03\",MAX(E$1:E32)+1,\"\")","v":""},{"$f":"IF('import danych'!$I38=\"YALE 04\",MAX(F$1:F32)+1,\"\")","v":""},{"$f":"IF('import danych'!$I38=\"SUR\",MAX(G$1:G32)+1,\"\")","v":""},{"$f":"IF('import danych'!$I38=\"SMP\",MAX(H$1:H32)+1,\"\")","v":""},{"$f":"IF('import danych'!E38=\"\",\"\",LOOKUP('import danych'!F38,#REF!,#REF!))","v":{"$error":"#REF!"}}]
[{"$f":"'import danych'!A39","v":"2012-10-05"},{"$f":"'import danych'!B39","v":"11:03"},{"$f":"IF('import danych'!$I39=\"LINDE 01\",MAX(C$1:C33)+1,\"\")","v":""},{"$f":"IF('import danych'!$I39=\"LINDE 02\",MAX(D$1:D33)+1,\"\")","v":""},{"$f":"IF('import danych'!$I39=\"LINDE 03\",MAX(E$1:E33)+1,\"\")","v":""},{"$f":"IF('import danych'!$I39=\"YALE 04\",MAX(F$1:F33)+1,\"\")","v":""},{"$f":"IF('import danych'!$I39=\"SUR\",MAX(G$1:G33)+1,\"\")","v":""},{"$f":"IF('import danych'!$I39=\"SMP\",MAX(H$1:H33)+1,\"\")","v":7},{"$f":"IF('import danych'!E39=\"\",\"\",LOOKUP('import danych'!F39,#REF!,#REF!))","v":{"$error":"#REF!"}}]
[{"$f":"'import danych'!A40","v":"2012-10-05"},{"$f":"'import danych'!B40","v":"11:09"},{"$f":"IF('import danych'!$I40=\"LINDE 01\",MAX(C$1:C34)+1,\"\")","v":""},{"$f":"IF('import danych'!$I40=\"LINDE 02\",MAX(D$1:D34)+1,\"\")","v":""},{"$f":"IF('import danych'!$I40=\"LINDE 03\",MAX(E$1:E34)+1,\"\")","v":11},{"$f":"IF('import danych'!$I40=\"YALE 04\",MAX(F$1:F34)+1,\"\")","v":""},{"$f":"IF('import danych'!$I40=\"SUR\",MAX(G$1:G34)+1,\"\")","v":""},{"$f":"IF('import danych'!$I40=\"SMP\",MAX(H$1:H34)+1,\"\")","v":""},{"$f":"IF('import danych'!E40=\"\",\"\",LOOKUP('import danych'!F40,#REF!,#REF!))","v":{"$error":"#REF!"}}]
[{"$f":"'import danych'!A41","v":"2012-10-05"},{"$f":"'import danych'!B41","v":"13:04"},{"$f":"IF('import danych'!$I41=\"LINDE 01\",MAX(C$1:C35)+1,\"\")","v":""},{"$f":"IF('import danych'!$I41=\"LINDE 02\",MAX(D$1:D35)+1,\"\")","v":15},{"$f":"IF('import danych'!$I41=\"LINDE 03\",MAX(E$1:E35)+1,\"\")","v":""},{"$f":"IF('import danych'!$I41=\"YALE 04\",MAX(F$1:F35)+1,\"\")","v":""},{"$f":"IF('import danych'!$I41=\"SUR\",MAX(G$1:G35)+1,\"\")","v":""},{"$f":"IF('import danych'!$I41=\"SMP\",MAX(H$1:H35)+1,\"\")","v":""},{"$f":"IF('import danych'!E41=\"\",\"\",LOOKUP('import danych'!F41,#REF!,#REF!))","v":{"$error":"#REF!"}}]
[{"$f":"'import danych'!A42","v":"2012-10-05"},{"$f":"'import danych'!B42","v":"13:07"},{"$f":"IF('import danych'!$I42=\"LINDE 01\",MAX(C$1:C36)+1,\"\")","v":15},{"$f":"IF('import danych'!$I42=\"LINDE 02\",MAX(D$1:D36)+1,\"\")","v":""},{"$f":"IF('import danych'!$I42=\"LINDE 03\",MAX(E$1:E36)+1,\"\")","v":""},{"$f":"IF('import danych'!$I42=\"YALE 04\",MAX(F$1:F36)+1,\"\")","v":""},{"$f":"IF('import danych'!$I42=\"SUR\",MAX(G$1:G36)+1,\"\")","v":""},{"$f":"IF('import danych'!$I42=\"SMP\",MAX(H$1:H36)+1,\"\")","v":""},{"$f":"IF('import danych'!E42=\"\",\"\",LOOKUP('import danych'!F42,#REF!,#REF!))","v":{"$error":"#REF!"}}]
[{"$f":"'import danych'!A43","v":"2012-10-06"},{"$f":"'import danych'!B43","v":"12:42"},{"$f":"IF('import danych'!$I43=\"LINDE 01\",MAX(C$1:C37)+1,\"\")","v":""},{"$f":"IF('import danych'!$I43=\"LINDE 02\",MAX(D$1:D37)+1,\"\")","v":16},{"$f":"IF('import danych'!$I43=\"LINDE 03\",MAX(E$1:E37)+1,\"\")","v":""},{"$f":"IF('import danych'!$I43=\"YALE 04\",MAX(F$1:F37)+1,\"\")","v":""},{"$f":"IF('import danych'!$I43=\"SUR\",MAX(G$1:G37)+1,\"\")","v":""},{"$f":"IF('import danych'!$I43=\"SMP\",MAX(H$1:H37)+1,\"\")","v":""},{"$f":"IF('import danych'!E43=\"\",\"\",LOOKUP('import danych'!F43,#REF!,#REF!))","v":{"$error":"#REF!"}}]
[{"$f":"'import danych'!A44","v":"2012-10-06"},{"$f":"'import danych'!B44","v":"12:58"},{"$f":"IF('import danych'!$I44=\"LINDE 01\",MAX(C$1:C38)+1,\"\")","v":16},{"$f":"IF('import danych'!$I44=\"LINDE 02\",MAX(D$1:D38)+1,\"\")","v":""},{"$f":"IF('import danych'!$I44=\"LINDE 03\",MAX(E$1:E38)+1,\"\")","v":""},{"$f":"IF('import danych'!$I44=\"YALE 04\",MAX(F$1:F38)+1,\"\")","v":""},{"$f":"IF('import danych'!$I44=\"SUR\",MAX(G$1:G38)+1,\"\")","v":""},{"$f":"IF('import danych'!$I44=\"SMP\",MAX(H$1:H38)+1,\"\")","v":""},{"$f":"IF('import danych'!E44=\"\",\"\",LOOKUP('import danych'!F44,#REF!,#REF!))","v":{"$error":"#REF!"}}]
[{"$f":"'import danych'!A45","v":"2012-10-07"},{"$f":"'import danych'!B45","v":"12:36"},{"$f":"IF('import danych'!$I45=\"LINDE 01\",MAX(C$1:C39)+1,\"\")","v":""},{"$f":"IF('import danych'!$I45=\"LINDE 02\",MAX(D$1:D39)+1,\"\")","v":""},{"$f":"IF('import danych'!$I45=\"LINDE 03\",MAX(E$1:E39)+1,\"\")","v":12},{"$f":"IF('import danych'!$I45=\"YALE 04\",MAX(F$1:F39)+1,\"\")","v":""},{"$f":"IF('import danych'!$I45=\"SUR\",MAX(G$1:G39)+1,\"\")","v":""},{"$f":"IF('import danych'!$I45=\"SMP\",MAX(H$1:H39)+1,\"\")","v":""},{"$f":"IF('import danych'!E45=\"\",\"\",LOOKUP('import danych'!F45,#REF!,#REF!))","v":{"$error":"#REF!"}}]
[{"$f":"'import danych'!A46","v":"2012-10-08"},{"$f":"'import danych'!B46","v":"13:17"},{"$f":"IF('import danych'!$I46=\"LINDE 01\",MAX(C$1:C40)+1,\"\")","v":""},{"$f":"IF('import danych'!$I46=\"LINDE 02\",MAX(D$1:D40)+1,\"\")","v":17},{"$f":"IF('import danych'!$I46=\"LINDE 03\",MAX(E$1:E40)+1,\"\")","v":""},{"$f":"IF('import danych'!$I46=\"YALE 04\",MAX(F$1:F40)+1,\"\")","v":""},{"$f":"IF('import danych'!$I46=\"SUR\",MAX(G$1:G40)+1,\"\")","v":""},{"$f":"IF('import danych'!$I46=\"SMP\",MAX(H$1:H40)+1,\"\")","v":""},{"$f":"IF('import danych'!E46=\"\",\"\",LOOKUP('import danych'!F46,#REF!,#REF!))","v":{"$error":"#REF!"}}]
[{"$f":"'import danych'!A47","v":"2012-10-08"},{"$f":"'import danych'!B47","v":"13:19"},{"$f":"IF('import danych'!$I47=\"LINDE 01\",MAX(C$1:C41)+1,\"\")","v":17},{"$f":"IF('import danych'!$I47=\"LINDE 02\",MAX(D$1:D41)+1,\"\")","v":""},{"$f":"IF('import danych'!$I47=\"LINDE 03\",MAX(E$1:E41)+1,\"\")","v":""},{"$f":"IF('import danych'!$I47=\"YALE 04\",MAX(F$1:F41)+1,\"\")","v":""},{"$f":"IF('import danych'!$I47=\"SUR\",MAX(G$1:G41)+1,\"\")","v":""},{"$f":"IF('import danych'!$I47=\"SMP\",MAX(H$1:H41)+1,\"\")","v":""},{"$f":"IF('import danych'!E47=\"\",\"\",LOOKUP('import danych'!F47,#REF!,#REF!))","v":{"$error":"#REF!"}}]
[{"$f":"'import danych'!A48","v":"2012-10-09"},{"$f":"'import danych'!B48","v":"11:30"},{"$f":"IF('import danych'!$I48=\"LINDE 01\",MAX(C$1:C42)+1,\"\")","v":""},{"$f":"IF('import danych'!$I48=\"LINDE 02\",MAX(D$1:D42)+1,\"\")","v":18},{"$f":"IF('import danych'!$I48=\"LINDE 03\",MAX(E$1:E42)+1,\"\")","v":""},{"$f":"IF('import danych'!$I48=\"YALE 04\",MAX(F$1:F42)+1,\"\")","v":""},{"$f":"IF('import danych'!$I48=\"SUR\",MAX(G$1:G42)+1,\"\")","v":""},{"$f":"IF('import danych'!$I48=\"SMP\",MAX(H$1:H42)+1,\"\")","v":""},{"$f":"IF('import danych'!E48=\"\",\"\",LOOKUP('import danych'!F48,#REF!,#REF!))","v":{"$error":"#REF!"}}]
[{"$f":"'import danych'!A49","v":"2012-10-09"},{"$f":"'import danych'!B49","v":"11:33"},{"$f":"IF('import danych'!$I49=\"LINDE 01\",MAX(C$1:C43)+1,\"\")","v":18},{"$f":"IF('import danych'!$I49=\"LINDE 02\",MAX(D$1:D43)+1,\"\")","v":""},{"$f":"IF('import danych'!$I49=\"LINDE 03\",MAX(E$1:E43)+1,\"\")","v":""},{"$f":"IF('import danych'!$I49=\"YALE 04\",MAX(F$1:F43)+1,\"\")","v":""},{"$f":"IF('import danych'!$I49=\"SUR\",MAX(G$1:G43)+1,\"\")","v":""},{"$f":"IF('import danych'!$I49=\"SMP\",MAX(H$1:H43)+1,\"\")","v":""},{"$f":"IF('import danych'!E49=\"\",\"\",LOOKUP('import danych'!F49,#REF!,#REF!))","v":{"$error":"#REF!"}}]
[{"$f":"'import danych'!A50","v":"2012-10-09"},{"$f":"'import danych'!B50","v":"22:19"},{"$f":"IF('import danych'!$I50=\"LINDE 01\",MAX(C$1:C44)+1,\"\")","v":""},{"$f":"IF('import danych'!$I50=\"LINDE 02\",MAX(D$1:D44)+1,\"\")","v":""},{"$f":"IF('import danych'!$I50=\"LINDE 03\",MAX(E$1:E44)+1,\"\")","v":13},{"$f":"IF('import danych'!$I50=\"YALE 04\",MAX(F$1:F44)+1,\"\")","v":""},{"$f":"IF('import danych'!$I50=\"SUR\",MAX(G$1:G44)+1,\"\")","v":""},{"$f":"IF('import danych'!$I50=\"SMP\",MAX(H$1:H44)+1,\"\")","v":""},{"$f":"IF('import danych'!E50=\"\",\"\",LOOKUP('import danych'!F50,#REF!,#REF!))","v":{"$error":"#REF!"}}]
[{"$f":"'import danych'!A51","v":"2012-10-10"},{"$f":"'import danych'!B51","v":"07:30"},{"$f":"IF('import danych'!$I51=\"LINDE 01\",MAX(C$1:C45)+1,\"\")","v":""},{"$f":"IF('import danych'!$I51=\"LINDE 02\",MAX(D$1:D45)+1,\"\")","v":""},{"$f":"IF('import danych'!$I51=\"LINDE 03\",MAX(E$1:E45)+1,\"\")","v":""},{"$f":"IF('import danych'!$I51=\"YALE 04\",MAX(F$1:F45)+1,\"\")","v":""},{"$f":"IF('import danych'!$I51=\"SUR\",MAX(G$1:G45)+1,\"\")","v":""},{"$f":"IF('import danych'!$I51=\"SMP\",MAX(H$1:H45)+1,\"\")","v":8},{"$f":"IF('import danych'!E51=\"\",\"\",LOOKUP('import danych'!F51,#REF!,#REF!))","v":{"$error":"#REF!"}}]
[{"$f":"'import danych'!A52","v":"2012-10-10"},{"$f":"'import danych'!B52","v":"08:45"},{"$f":"IF('import danych'!$I52=\"LINDE 01\",MAX(C$1:C46)+1,\"\")","v":19},{"$f":"IF('import danych'!$I52=\"LINDE 02\",MAX(D$1:D46)+1,\"\")","v":""},{"$f":"IF('import danych'!$I52=\"LINDE 03\",MAX(E$1:E46)+1,\"\")","v":""},{"$f":"IF('import danych'!$I52=\"YALE 04\",MAX(F$1:F46)+1,\"\")","v":""},{"$f":"IF('import danych'!$I52=\"SUR\",MAX(G$1:G46)+1,\"\")","v":""},{"$f":"IF('import danych'!$I52=\"SMP\",MAX(H$1:H46)+1,\"\")","v":""},{"$f":"IF('import danych'!E52=\"\",\"\",LOOKUP('import danych'!F52,#REF!,#REF!))","v":{"$error":"#REF!"}}]
[{"$f":"'import danych'!A53","v":"2012-10-10"},{"$f":"'import danych'!B53","v":"08:48"},{"$f":"IF('import danych'!$I53=\"LINDE 01\",MAX(C$1:C47)+1,\"\")","v":""},{"$f":"IF('import danych'!$I53=\"LINDE 02\",MAX(D$1:D47)+1,\"\")","v":19},{"$f":"IF('import danych'!$I53=\"LINDE 03\",MAX(E$1:E47)+1,\"\")","v":""},{"$f":"IF('import danych'!$I53=\"YALE 04\",MAX(F$1:F47)+1,\"\")","v":""},{"$f":"IF('import danych'!$I53=\"SUR\",MAX(G$1:G47)+1,\"\")","v":""},{"$f":"IF('import danych'!$I53=\"SMP\",MAX(H$1:H47)+1,\"\")","v":""},{"$f":"IF('import danych'!E53=\"\",\"\",LOOKUP('import danych'!F53,#REF!,#REF!))","v":{"$error":"#REF!"}}]
[{"$f":"'import danych'!A54","v":"2012-10-11"},{"$f":"'import danych'!B54","v":"10:23"},{"$f":"IF('import danych'!$I54=\"LINDE 01\",MAX(C$1:C48)+1,\"\")","v":20},{"$f":"IF('import danych'!$I54=\"LINDE 02\",MAX(D$1:D48)+1,\"\")","v":""},{"$f":"IF('import danych'!$I54=\"LINDE 03\",MAX(E$1:E48)+1,\"\")","v":""},{"$f":"IF('import danych'!$I54=\"YALE 04\",MAX(F$1:F48)+1,\"\")","v":""},{"$f":"IF('import danych'!$I54=\"SUR\",MAX(G$1:G48)+1,\"\")","v":""},{"$f":"IF('import danych'!$I54=\"SMP\",MAX(H$1:H48)+1,\"\")","v":""},{"$f":"IF('import danych'!E54=\"\",\"\",LOOKUP('import danych'!F54,#REF!,#REF!))","v":{"$error":"#REF!"}}]
[{"$f":"'import danych'!A55","v":"2012-10-11"},{"$f":"'import danych'!B55","v":"10:26"},{"$f":"IF('import danych'!$I55=\"LINDE 01\",MAX(C$1:C49)+1,\"\")","v":""},{"$f":"IF('import danych'!$I55=\"LINDE 02\",MAX(D$1:D49)+1,\"\")","v":20},{"$f":"IF('import danych'!$I55=\"LINDE 03\",MAX(E$1:E49)+1,\"\")","v":""},{"$f":"IF('import danych'!$I55=\"YALE 04\",MAX(F$1:F49)+1,\"\")","v":""},{"$f":"IF('import danych'!$I55=\"SUR\",MAX(G$1:G49)+1,\"\")","v":""},{"$f":"IF('import danych'!$I55=\"SMP\",MAX(H$1:H49)+1,\"\")","v":""},{"$f":"IF('import danych'!E55=\"\",\"\",LOOKUP('import danych'!F55,#REF!,#REF!))","v":{"$error":"#REF!"}}]
[{"$f":"'import danych'!A56","v":"2012-10-11"},{"$f":"'import danych'!B56","v":"17:07"},{"$f":"IF('import danych'!$I56=\"LINDE 01\",MAX(C$1:C50)+1,\"\")","v":""},{"$f":"IF('import danych'!$I56=\"LINDE 02\",MAX(D$1:D50)+1,\"\")","v":""},{"$f":"IF('import danych'!$I56=\"LINDE 03\",MAX(E$1:E50)+1,\"\")","v":14},{"$f":"IF('import danych'!$I56=\"YALE 04\",MAX(F$1:F50)+1,\"\")","v":""},{"$f":"IF('import danych'!$I56=\"SUR\",MAX(G$1:G50)+1,\"\")","v":""},{"$f":"IF('import danych'!$I56=\"SMP\",MAX(H$1:H50)+1,\"\")","v":""},{"$f":"IF('import danych'!E56=\"\",\"\",LOOKUP('import danych'!F56,#REF!,#REF!))","v":{"$error":"#REF!"}}]
[{"$f":"'import danych'!A57","v":"2012-10-12"},{"$f":"'import danych'!B57","v":"05:18"},{"$f":"IF('import danych'!$I57=\"LINDE 01\",MAX(C$1:C51)+1,\"\")","v":""},{"$f":"IF('import danych'!$I57=\"LINDE 02\",MAX(D$1:D51)+1,\"\")","v":21},{"$f":"IF('import danych'!$I57=\"LINDE 03\",MAX(E$1:E51)+1,\"\")","v":""},{"$f":"IF('import danych'!$I57=\"YALE 04\",MAX(F$1:F51)+1,\"\")","v":""},{"$f":"IF('import danych'!$I57=\"SUR\",MAX(G$1:G51)+1,\"\")","v":""},{"$f":"IF('import danych'!$I57=\"SMP\",MAX(H$1:H51)+1,\"\")","v":""},{"$f":"IF('import danych'!E57=\"\",\"\",LOOKUP('import danych'!F57,#REF!,#REF!))","v":{"$error":"#REF!"}}]
[{"$f":"'import danych'!A58","v":"2012-10-12"},{"$f":"'import danych'!B58","v":"11:27"},{"$f":"IF('import danych'!$I58=\"LINDE 01\",MAX(C$1:C52)+1,\"\")","v":21},{"$f":"IF('import danych'!$I58=\"LINDE 02\",MAX(D$1:D52)+1,\"\")","v":""},{"$f":"IF('import danych'!$I58=\"LINDE 03\",MAX(E$1:E52)+1,\"\")","v":""},{"$f":"IF('import danych'!$I58=\"YALE 04\",MAX(F$1:F52)+1,\"\")","v":""},{"$f":"IF('import danych'!$I58=\"SUR\",MAX(G$1:G52)+1,\"\")","v":""},{"$f":"IF('import danych'!$I58=\"SMP\",MAX(H$1:H52)+1,\"\")","v":""},{"$f":"IF('import danych'!E58=\"\",\"\",LOOKUP('import danych'!F58,#REF!,#REF!))","v":{"$error":"#REF!"}}]
[{"$f":"'import danych'!A59","v":"2012-10-12"},{"$f":"'import danych'!B59","v":"12:59"},{"$f":"IF('import danych'!$I59=\"LINDE 01\",MAX(C$1:C53)+1,\"\")","v":""},{"$f":"IF('import danych'!$I59=\"LINDE 02\",MAX(D$1:D53)+1,\"\")","v":22},{"$f":"IF('import danych'!$I59=\"LINDE 03\",MAX(E$1:E53)+1,\"\")","v":""},{"$f":"IF('import danych'!$I59=\"YALE 04\",MAX(F$1:F53)+1,\"\")","v":""},{"$f":"IF('import danych'!$I59=\"SUR\",MAX(G$1:G53)+1,\"\")","v":""},{"$f":"IF('import danych'!$I59=\"SMP\",MAX(H$1:H53)+1,\"\")","v":""},{"$f":"IF('import danych'!E59=\"\",\"\",LOOKUP('import danych'!F59,#REF!,#REF!))","v":{"$error":"#REF!"}}]
[{"$f":"'import danych'!A60","v":"2012-10-13"},{"$f":"'import danych'!B60","v":"11:18"},{"$f":"IF('import danych'!$I60=\"LINDE 01\",MAX(C$1:C54)+1,\"\")","v":""},{"$f":"IF('import danych'!$I60=\"LINDE 02\",MAX(D$1:D54)+1,\"\")","v":23},{"$f":"IF('import danych'!$I60=\"LINDE 03\",MAX(E$1:E54)+1,\"\")","v":""},{"$f":"IF('import danych'!$I60=\"YALE 04\",MAX(F$1:F54)+1,\"\")","v":""},{"$f":"IF('import danych'!$I60=\"SUR\",MAX(G$1:G54)+1,\"\")","v":""},{"$f":"IF('import danych'!$I60=\"SMP\",MAX(H$1:H54)+1,\"\")","v":""},{"$f":"IF('import danych'!E60=\"\",\"\",LOOKUP('import danych'!F60,#REF!,#REF!))","v":{"$error":"#REF!"}}]
[{"$f":"'import danych'!A61","v":"2012-10-14"},{"$f":"'import danych'!B61","v":"10:31"},{"$f":"IF('import danych'!$I61=\"LINDE 01\",MAX(C$1:C55)+1,\"\")","v":22},{"$f":"IF('import danych'!$I61=\"LINDE 02\",MAX(D$1:D55)+1,\"\")","v":""},{"$f":"IF('import danych'!$I61=\"LINDE 03\",MAX(E$1:E55)+1,\"\")","v":""},{"$f":"IF('import danych'!$I61=\"YALE 04\",MAX(F$1:F55)+1,\"\")","v":""},{"$f":"IF('import danych'!$I61=\"SUR\",MAX(G$1:G55)+1,\"\")","v":""},{"$f":"IF('import danych'!$I61=\"SMP\",MAX(H$1:H55)+1,\"\")","v":""},{"$f":"IF('import danych'!E61=\"\",\"\",LOOKUP('import danych'!F61,#REF!,#REF!))","v":{"$error":"#REF!"}}]
[{"$f":"'import danych'!A62","v":"2012-10-15"},{"$f":"'import danych'!B62","v":"07:33"},{"$f":"IF('import danych'!$I62=\"LINDE 01\",MAX(C$1:C56)+1,\"\")","v":""},{"$f":"IF('import danych'!$I62=\"LINDE 02\",MAX(D$1:D56)+1,\"\")","v":""},{"$f":"IF('import danych'!$I62=\"LINDE 03\",MAX(E$1:E56)+1,\"\")","v":""},{"$f":"IF('import danych'!$I62=\"YALE 04\",MAX(F$1:F56)+1,\"\")","v":""},{"$f":"IF('import danych'!$I62=\"SUR\",MAX(G$1:G56)+1,\"\")","v":6},{"$f":"IF('import danych'!$I62=\"SMP\",MAX(H$1:H56)+1,\"\")","v":""},{"$f":"IF('import danych'!E62=\"\",\"\",LOOKUP('import danych'!F62,#REF!,#REF!))","v":{"$error":"#REF!"}}]
[{"$f":"'import danych'!A63","v":"2012-10-15"},{"$f":"'import danych'!B63","v":"12:57"},{"$f":"IF('import danych'!$I63=\"LINDE 01\",MAX(C$1:C57)+1,\"\")","v":""},{"$f":"IF('import danych'!$I63=\"LINDE 02\",MAX(D$1:D57)+1,\"\")","v":24},{"$f":"IF('import danych'!$I63=\"LINDE 03\",MAX(E$1:E57)+1,\"\")","v":""},{"$f":"IF('import danych'!$I63=\"YALE 04\",MAX(F$1:F57)+1,\"\")","v":""},{"$f":"IF('import danych'!$I63=\"SUR\",MAX(G$1:G57)+1,\"\")","v":""},{"$f":"IF('import danych'!$I63=\"SMP\",MAX(H$1:H57)+1,\"\")","v":""},{"$f":"IF('import danych'!E63=\"\",\"\",LOOKUP('import danych'!F63,#REF!,#REF!))","v":{"$error":"#REF!"}}]
[{"$f":"'import danych'!A64","v":"2012-10-15"},{"$f":"'import danych'!B64","v":"13:01"},{"$f":"IF('import danych'!$I64=\"LINDE 01\",MAX(C$1:C58)+1,\"\")","v":23},{"$f":"IF('import danych'!$I64=\"LINDE 02\",MAX(D$1:D58)+1,\"\")","v":""},{"$f":"IF('import danych'!$I64=\"LINDE 03\",MAX(E$1:E58)+1,\"\")","v":""},{"$f":"IF('import danych'!$I64=\"YALE 04\",MAX(F$1:F58)+1,\"\")","v":""},{"$f":"IF('import danych'!$I64=\"SUR\",MAX(G$1:G58)+1,\"\")","v":""},{"$f":"IF('import danych'!$I64=\"SMP\",MAX(H$1:H58)+1,\"\")","v":""},{"$f":"IF('import danych'!E64=\"\",\"\",LOOKUP('import danych'!F64,#REF!,#REF!))","v":{"$error":"#REF!"}}]
[{"$f":"'import danych'!A65","v":"2012-10-16"},{"$f":"'import danych'!B65","v":"10:51"},{"$f":"IF('import danych'!$I65=\"LINDE 01\",MAX(C$1:C59)+1,\"\")","v":""},{"$f":"IF('import danych'!$I65=\"LINDE 02\",MAX(D$1:D59)+1,\"\")","v":""},{"$f":"IF('import danych'!$I65=\"LINDE 03\",MAX(E$1:E59)+1,\"\")","v":15},{"$f":"IF('import danych'!$I65=\"YALE 04\",MAX(F$1:F59)+1,\"\")","v":""},{"$f":"IF('import danych'!$I65=\"SUR\",MAX(G$1:G59)+1,\"\")","v":""},{"$f":"IF('import danych'!$I65=\"SMP\",MAX(H$1:H59)+1,\"\")","v":""},{"$f":"IF('import danych'!E65=\"\",\"\",LOOKUP('import danych'!F65,#REF!,#REF!))","v":{"$error":"#REF!"}}]
[{"$f":"'import danych'!A66","v":"2012-10-16"},{"$f":"'import danych'!B66","v":"11:18"},{"$f":"IF('import danych'!$I66=\"LINDE 01\",MAX(C$1:C60)+1,\"\")","v":24},{"$f":"IF('import danych'!$I66=\"LINDE 02\",MAX(D$1:D60)+1,\"\")","v":""},{"$f":"IF('import danych'!$I66=\"LINDE 03\",MAX(E$1:E60)+1,\"\")","v":""},{"$f":"IF('import danych'!$I66=\"YALE 04\",MAX(F$1:F60)+1,\"\")","v":""},{"$f":"IF('import danych'!$I66=\"SUR\",MAX(G$1:G60)+1,\"\")","v":""},{"$f":"IF('import danych'!$I66=\"SMP\",MAX(H$1:H60)+1,\"\")","v":""},{"$f":"IF('import danych'!E66=\"\",\"\",LOOKUP('import danych'!F66,#REF!,#REF!))","v":{"$error":"#REF!"}}]
[{"$f":"'import danych'!A67","v":"2012-10-16"},{"$f":"'import danych'!B67","v":"19:59"},{"$f":"IF('import danych'!$I67=\"LINDE 01\",MAX(C$1:C61)+1,\"\")","v":""},{"$f":"IF('import danych'!$I67=\"LINDE 02\",MAX(D$1:D61)+1,\"\")","v":25},{"$f":"IF('import danych'!$I67=\"LINDE 03\",MAX(E$1:E61)+1,\"\")","v":""},{"$f":"IF('import danych'!$I67=\"YALE 04\",MAX(F$1:F61)+1,\"\")","v":""},{"$f":"IF('import danych'!$I67=\"SUR\",MAX(G$1:G61)+1,\"\")","v":""},{"$f":"IF('import danych'!$I67=\"SMP\",MAX(H$1:H61)+1,\"\")","v":""},{"$f":"IF('import danych'!E67=\"\",\"\",LOOKUP('import danych'!F67,#REF!,#REF!))","v":{"$error":"#REF!"}}]
[{"$f":"'import danych'!A68","v":"2012-10-17"},{"$f":"'import danych'!B68","v":"11:08"},{"$f":"IF('import danych'!$I68=\"LINDE 01\",MAX(C$1:C62)+1,\"\")","v":25},{"$f":"IF('import danych'!$I68=\"LINDE 02\",MAX(D$1:D62)+1,\"\")","v":""},{"$f":"IF('import danych'!$I68=\"LINDE 03\",MAX(E$1:E62)+1,\"\")","v":""},{"$f":"IF('import danych'!$I68=\"YALE 04\",MAX(F$1:F62)+1,\"\")","v":""},{"$f":"IF('import danych'!$I68=\"SUR\",MAX(G$1:G62)+1,\"\")","v":""},{"$f":"IF('import danych'!$I68=\"SMP\",MAX(H$1:H62)+1,\"\")","v":""},{"$f":"IF('import danych'!E68=\"\",\"\",LOOKUP('import danych'!F68,#REF!,#REF!))","v":{"$error":"#REF!"}}]
[{"$f":"'import danych'!A69","v":"2012-10-17"},{"$f":"'import danych'!B69","v":"13:16"},{"$f":"IF('import danych'!$I69=\"LINDE 01\",MAX(C$1:C63)+1,\"\")","v":""},{"$f":"IF('import danych'!$I69=\"LINDE 02\",MAX(D$1:D63)+1,\"\")","v":26},{"$f":"IF('import danych'!$I69=\"LINDE 03\",MAX(E$1:E63)+1,\"\")","v":""},{"$f":"IF('import danych'!$I69=\"YALE 04\",MAX(F$1:F63)+1,\"\")","v":""},{"$f":"IF('import danych'!$I69=\"SUR\",MAX(G$1:G63)+1,\"\")","v":""},{"$f":"IF('import danych'!$I69=\"SMP\",MAX(H$1:H63)+1,\"\")","v":""},{"$f":"IF('import danych'!D69=\"\",\"\",LOOKUP('import danych'!F69,#REF!,#REF!))","v":{"$error":"#REF!"}}]
[{"$f":"'import danych'!A70","v":"2012-10-18"},{"$f":"'import danych'!B70","v":"11:03"},{"$f":"IF('import danych'!$I70=\"LINDE 01\",MAX(C$1:C64)+1,\"\")","v":26},{"$f":"IF('import danych'!$I70=\"LINDE 02\",MAX(D$1:D64)+1,\"\")","v":""},{"$f":"IF('import danych'!$I70=\"LINDE 03\",MAX(E$1:E64)+1,\"\")","v":""},{"$f":"IF('import danych'!$I70=\"YALE 04\",MAX(F$1:F64)+1,\"\")","v":""},{"$f":"IF('import danych'!$I70=\"SUR\",MAX(G$1:G64)+1,\"\")","v":""},{"$f":"IF('import danych'!$I70=\"SMP\",MAX(H$1:H64)+1,\"\")","v":""},{"$f":"IF('import danych'!D70=\"\",\"\",LOOKUP('import danych'!F70,#REF!,#REF!))","v":{"$error":"#REF!"}}]
[{"$f":"'import danych'!A71","v":"2012-10-18"},{"$f":"'import danych'!B71","v":"12:57"},{"$f":"IF('import danych'!$I71=\"LINDE 01\",MAX(C$1:C65)+1,\"\")","v":""},{"$f":"IF('import danych'!$I71=\"LINDE 02\",MAX(D$1:D65)+1,\"\")","v":27},{"$f":"IF('import danych'!$I71=\"LINDE 03\",MAX(E$1:E65)+1,\"\")","v":""},{"$f":"IF('import danych'!$I71=\"YALE 04\",MAX(F$1:F65)+1,\"\")","v":""},{"$f":"IF('import danych'!$I71=\"SUR\",MAX(G$1:G65)+1,\"\")","v":""},{"$f":"IF('import danych'!$I71=\"SMP\",MAX(H$1:H65)+1,\"\")","v":""},{"$f":"IF('import danych'!D71=\"\",\"\",LOOKUP('import danych'!F71,#REF!,#REF!))","v":{"$error":"#REF!"}}]
[{"$f":"'import danych'!A72","v":"2012-10-18"},{"$f":"'import danych'!B72","v":"15:14"},{"$f":"IF('import danych'!$I72=\"LINDE 01\",MAX(C$1:C66)+1,\"\")","v":""},{"$f":"IF('import danych'!$I72=\"LINDE 02\",MAX(D$1:D66)+1,\"\")","v":""},{"$f":"IF('import danych'!$I72=\"LINDE 03\",MAX(E$1:E66)+1,\"\")","v":16},{"$f":"IF('import danych'!$I72=\"YALE 04\",MAX(F$1:F66)+1,\"\")","v":""},{"$f":"IF('import danych'!$I72=\"SUR\",MAX(G$1:G66)+1,\"\")","v":""},{"$f":"IF('import danych'!$I72=\"SMP\",MAX(H$1:H66)+1,\"\")","v":""},{"$f":"IF('import danych'!D72=\"\",\"\",LOOKUP('import danych'!F72,#REF!,#REF!))","v":{"$error":"#REF!"}}]
[{"$f":"'import danych'!A73","v":"2012-10-19"},{"$f":"'import danych'!B73","v":"13:23"},{"$f":"IF('import danych'!$I73=\"LINDE 01\",MAX(C$1:C67)+1,\"\")","v":""},{"$f":"IF('import danych'!$I73=\"LINDE 02\",MAX(D$1:D67)+1,\"\")","v":28},{"$f":"IF('import danych'!$I73=\"LINDE 03\",MAX(E$1:E67)+1,\"\")","v":""},{"$f":"IF('import danych'!$I73=\"YALE 04\",MAX(F$1:F67)+1,\"\")","v":""},{"$f":"IF('import danych'!$I73=\"SUR\",MAX(G$1:G67)+1,\"\")","v":""},{"$f":"IF('import danych'!$I73=\"SMP\",MAX(H$1:H67)+1,\"\")","v":""},{"$f":"IF('import danych'!D73=\"\",\"\",LOOKUP('import danych'!F73,#REF!,#REF!))","v":{"$error":"#REF!"}}]
[{"$f":"'import danych'!A74","v":"2012-10-19"},{"$f":"'import danych'!B74","v":"13:32"},{"$f":"IF('import danych'!$I74=\"LINDE 01\",MAX(C$1:C68)+1,\"\")","v":27},{"$f":"IF('import danych'!$I74=\"LINDE 02\",MAX(D$1:D68)+1,\"\")","v":""},{"$f":"IF('import danych'!$I74=\"LINDE 03\",MAX(E$1:E68)+1,\"\")","v":""},{"$f":"IF('import danych'!$I74=\"YALE 04\",MAX(F$1:F68)+1,\"\")","v":""},{"$f":"IF('import danych'!$I74=\"SUR\",MAX(G$1:G68)+1,\"\")","v":""},{"$f":"IF('import danych'!$I74=\"SMP\",MAX(H$1:H68)+1,\"\")","v":""},{"$f":"IF('import danych'!D74=\"\",\"\",LOOKUP('import danych'!F74,#REF!,#REF!))","v":{"$error":"#REF!"}}]
[{"$f":"'import danych'!A75","v":"2012-10-20"},{"$f":"'import danych'!B75","v":"13:03"},{"$f":"IF('import danych'!$I75=\"LINDE 01\",MAX(C$1:C69)+1,\"\")","v":""},{"$f":"IF('import danych'!$I75=\"LINDE 02\",MAX(D$1:D69)+1,\"\")","v":29},{"$f":"IF('import danych'!$I75=\"LINDE 03\",MAX(E$1:E69)+1,\"\")","v":""},{"$f":"IF('import danych'!$I75=\"YALE 04\",MAX(F$1:F69)+1,\"\")","v":""},{"$f":"IF('import danych'!$I75=\"SUR\",MAX(G$1:G69)+1,\"\")","v":""},{"$f":"IF('import danych'!$I75=\"SMP\",MAX(H$1:H69)+1,\"\")","v":""},{"$f":"IF('import danych'!D75=\"\",\"\",LOOKUP('import danych'!F75,#REF!,#REF!))","v":{"$error":"#REF!"}}]
[{"$f":"'import danych'!A76","v":"2012-10-20"},{"$f":"'import danych'!B76","v":"13:06"},{"$f":"IF('import danych'!$I76=\"LINDE 01\",MAX(C$1:C70)+1,\"\")","v":28},{"$f":"IF('import danych'!$I76=\"LINDE 02\",MAX(D$1:D70)+1,\"\")","v":""},{"$f":"IF('import danych'!$I76=\"LINDE 03\",MAX(E$1:E70)+1,\"\")","v":""},{"$f":"IF('import danych'!$I76=\"YALE 04\",MAX(F$1:F70)+1,\"\")","v":""},{"$f":"IF('import danych'!$I76=\"SUR\",MAX(G$1:G70)+1,\"\")","v":""},{"$f":"IF('import danych'!$I76=\"SMP\",MAX(H$1:H70)+1,\"\")","v":""},{"$f":"IF('import danych'!D76=\"\",\"\",LOOKUP('import danych'!F76,#REF!,#REF!))","v":{"$error":"#REF!"}}]
[{"$f":"'import danych'!A77","v":"2012-10-21"},{"$f":"'import danych'!B77","v":"07:15"},{"$f":"IF('import danych'!$I77=\"LINDE 01\",MAX(C$1:C71)+1,\"\")","v":""},{"$f":"IF('import danych'!$I77=\"LINDE 02\",MAX(D$1:D71)+1,\"\")","v":""},{"$f":"IF('import danych'!$I77=\"LINDE 03\",MAX(E$1:E71)+1,\"\")","v":17},{"$f":"IF('import danych'!$I77=\"YALE 04\",MAX(F$1:F71)+1,\"\")","v":""},{"$f":"IF('import danych'!$I77=\"SUR\",MAX(G$1:G71)+1,\"\")","v":""},{"$f":"IF('import danych'!$I77=\"SMP\",MAX(H$1:H71)+1,\"\")","v":""},{"$f":"IF('import danych'!D77=\"\",\"\",LOOKUP('import danych'!F77,#REF!,#REF!))","v":{"$error":"#REF!"}}]
[{"$f":"'import danych'!A78","v":"2012-10-22"},{"$f":"'import danych'!B78","v":"12:32"},{"$f":"IF('import danych'!$I78=\"LINDE 01\",MAX(C$1:C72)+1,\"\")","v":""},{"$f":"IF('import danych'!$I78=\"LINDE 02\",MAX(D$1:D72)+1,\"\")","v":""},{"$f":"IF('import danych'!$I78=\"LINDE 03\",MAX(E$1:E72)+1,\"\")","v":18},{"$f":"IF('import danych'!$I78=\"YALE 04\",MAX(F$1:F72)+1,\"\")","v":""},{"$f":"IF('import danych'!$I78=\"SUR\",MAX(G$1:G72)+1,\"\")","v":""},{"$f":"IF('import danych'!$I78=\"SMP\",MAX(H$1:H72)+1,\"\")","v":""},{"$f":"IF('import danych'!D78=\"\",\"\",LOOKUP('import danych'!F78,#REF!,#REF!))","v":{"$error":"#REF!"}}]
[{"$f":"'import danych'!A79","v":"2012-10-22"},{"$f":"'import danych'!B79","v":"12:58"},{"$f":"IF('import danych'!$I79=\"LINDE 01\",MAX(C$1:C73)+1,\"\")","v":29},{"$f":"IF('import danych'!$I79=\"LINDE 02\",MAX(D$1:D73)+1,\"\")","v":""},{"$f":"IF('import danych'!$I79=\"LINDE 03\",MAX(E$1:E73)+1,\"\")","v":""},{"$f":"IF('import danych'!$I79=\"YALE 04\",MAX(F$1:F73)+1,\"\")","v":""},{"$f":"IF('import danych'!$I79=\"SUR\",MAX(G$1:G73)+1,\"\")","v":""},{"$f":"IF('import danych'!$I79=\"SMP\",MAX(H$1:H73)+1,\"\")","v":""},{"$f":"IF('import danych'!D79=\"\",\"\",LOOKUP('import danych'!F79,#REF!,#REF!))","v":{"$error":"#REF!"}}]
[{"$f":"'import danych'!A80","v":"2012-10-22"},{"$f":"'import danych'!B80","v":"13:41"},{"$f":"IF('import danych'!$I80=\"LINDE 01\",MAX(C$1:C74)+1,\"\")","v":""},{"$f":"IF('import danych'!$I80=\"LINDE 02\",MAX(D$1:D74)+1,\"\")","v":30},{"$f":"IF('import danych'!$I80=\"LINDE 03\",MAX(E$1:E74)+1,\"\")","v":""},{"$f":"IF('import danych'!$I80=\"YALE 04\",MAX(F$1:F74)+1,\"\")","v":""},{"$f":"IF('import danych'!$I80=\"SUR\",MAX(G$1:G74)+1,\"\")","v":""},{"$f":"IF('import danych'!$I80=\"SMP\",MAX(H$1:H74)+1,\"\")","v":""},{"$f":"IF('import danych'!D80=\"\",\"\",LOOKUP('import danych'!F80,#REF!,#REF!))","v":{"$error":"#REF!"}}]
[{"$f":"'import danych'!A81","v":"2012-10-23"},{"$f":"'import danych'!B81","v":"13:06"},{"$f":"IF('import danych'!$I81=\"LINDE 01\",MAX(C$1:C75)+1,\"\")","v":30},{"$f":"IF('import danych'!$I81=\"LINDE 02\",MAX(D$1:D75)+1,\"\")","v":""},{"$f":"IF('import danych'!$I81=\"LINDE 03\",MAX(E$1:E75)+1,\"\")","v":""},{"$f":"IF('import danych'!$I81=\"YALE 04\",MAX(F$1:F75)+1,\"\")","v":""},{"$f":"IF('import danych'!$I81=\"SUR\",MAX(G$1:G75)+1,\"\")","v":""},{"$f":"IF('import danych'!$I81=\"SMP\",MAX(H$1:H75)+1,\"\")","v":""},{"$f":"IF('import danych'!D81=\"\",\"\",LOOKUP('import danych'!F81,#REF!,#REF!))","v":{"$error":"#REF!"}}]
[{"$f":"'import danych'!A82","v":"2012-10-23"},{"$f":"'import danych'!B82","v":"18:02"},{"$f":"IF('import danych'!$I82=\"LINDE 01\",MAX(C$1:C76)+1,\"\")","v":""},{"$f":"IF('import danych'!$I82=\"LINDE 02\",MAX(D$1:D76)+1,\"\")","v":31},{"$f":"IF('import danych'!$I82=\"LINDE 03\",MAX(E$1:E76)+1,\"\")","v":""},{"$f":"IF('import danych'!$I82=\"YALE 04\",MAX(F$1:F76)+1,\"\")","v":""},{"$f":"IF('import danych'!$I82=\"SUR\",MAX(G$1:G76)+1,\"\")","v":""},{"$f":"IF('import danych'!$I82=\"SMP\",MAX(H$1:H76)+1,\"\")","v":""},{"$f":"IF('import danych'!D82=\"\",\"\",LOOKUP('import danych'!F82,#REF!,#REF!))","v":{"$error":"#REF!"}}]
[{"$f":"'import danych'!A83","v":"2012-10-24"},{"$f":"'import danych'!B83","v":"10:18"},{"$f":"IF('import danych'!$I83=\"LINDE 01\",MAX(C$1:C77)+1,\"\")","v":""},{"$f":"IF('import danych'!$I83=\"LINDE 02\",MAX(D$1:D77)+1,\"\")","v":""},{"$f":"IF('import danych'!$I83=\"LINDE 03\",MAX(E$1:E77)+1,\"\")","v":19},{"$f":"IF('import danych'!$I83=\"YALE 04\",MAX(F$1:F77)+1,\"\")","v":""},{"$f":"IF('import danych'!$I83=\"SUR\",MAX(G$1:G77)+1,\"\")","v":""},{"$f":"IF('import danych'!$I83=\"SMP\",MAX(H$1:H77)+1,\"\")","v":""},{"$f":"IF('import danych'!D83=\"\",\"\",LOOKUP('import danych'!F83,#REF!,#REF!))","v":{"$error":"#REF!"}}]
[{"$f":"'import danych'!A84","v":"2012-10-24"},{"$f":"'import danych'!B84","v":"13:04"},{"$f":"IF('import danych'!$I84=\"LINDE 01\",MAX(C$1:C78)+1,\"\")","v":31},{"$f":"IF('import danych'!$I84=\"LINDE 02\",MAX(D$1:D78)+1,\"\")","v":""},{"$f":"IF('import danych'!$I84=\"LINDE 03\",MAX(E$1:E78)+1,\"\")","v":""},{"$f":"IF('import danych'!$I84=\"YALE 04\",MAX(F$1:F78)+1,\"\")","v":""},{"$f":"IF('import danych'!$I84=\"SUR\",MAX(G$1:G78)+1,\"\")","v":""},{"$f":"IF('import danych'!$I84=\"SMP\",MAX(H$1:H78)+1,\"\")","v":""},{"$f":"IF('import danych'!D84=\"\",\"\",LOOKUP('import danych'!F84,#REF!,#REF!))","v":{"$error":"#REF!"}}]
[{"$f":"'import danych'!A85","v":"2012-10-24"},{"$f":"'import danych'!B85","v":"18:18"},{"$f":"IF('import danych'!$I85=\"LINDE 01\",MAX(C$1:C79)+1,\"\")","v":""},{"$f":"IF('import danych'!$I85=\"LINDE 02\",MAX(D$1:D79)+1,\"\")","v":32},{"$f":"IF('import danych'!$I85=\"LINDE 03\",MAX(E$1:E79)+1,\"\")","v":""},{"$f":"IF('import danych'!$I85=\"YALE 04\",MAX(F$1:F79)+1,\"\")","v":""},{"$f":"IF('import danych'!$I85=\"SUR\",MAX(G$1:G79)+1,\"\")","v":""},{"$f":"IF('import danych'!$I85=\"SMP\",MAX(H$1:H79)+1,\"\")","v":""},{"$f":"IF('import danych'!D85=\"\",\"\",LOOKUP('import danych'!F85,#REF!,#REF!))","v":{"$error":"#REF!"}}]
[{"$f":"'import danych'!A86","v":"2012-10-25"},{"$f":"'import danych'!B86","v":"12:56"},{"$f":"IF('import danych'!$I86=\"LINDE 01\",MAX(C$1:C80)+1,\"\")","v":""},{"$f":"IF('import danych'!$I86=\"LINDE 02\",MAX(D$1:D80)+1,\"\")","v":""},{"$f":"IF('import danych'!$I86=\"LINDE 03\",MAX(E$1:E80)+1,\"\")","v":""},{"$f":"IF('import danych'!$I86=\"YALE 04\",MAX(F$1:F80)+1,\"\")","v":""},{"$f":"IF('import danych'!$I86=\"SUR\",MAX(G$1:G80)+1,\"\")","v":7},{"$f":"IF('import danych'!$I86=\"SMP\",MAX(H$1:H80)+1,\"\")","v":""},{"$f":"IF('import danych'!D86=\"\",\"\",LOOKUP('import danych'!F86,#REF!,#REF!))","v":{"$error":"#REF!"}}]
[{"$f":"'import danych'!A87","v":"2012-10-25"},{"$f":"'import danych'!B87","v":"13:03"},{"$f":"IF('import danych'!$I87=\"LINDE 01\",MAX(C$1:C81)+1,\"\")","v":""},{"$f":"IF('import danych'!$I87=\"LINDE 02\",MAX(D$1:D81)+1,\"\")","v":33},{"$f":"IF('import danych'!$I87=\"LINDE 03\",MAX(E$1:E81)+1,\"\")","v":""},{"$f":"IF('import danych'!$I87=\"YALE 04\",MAX(F$1:F81)+1,\"\")","v":""},{"$f":"IF('import danych'!$I87=\"SUR\",MAX(G$1:G81)+1,\"\")","v":""},{"$f":"IF('import danych'!$I87=\"SMP\",MAX(H$1:H81)+1,\"\")","v":""},{"$f":"IF('import danych'!D87=\"\",\"\",LOOKUP('import danych'!F87,#REF!,#REF!))","v":{"$error":"#REF!"}}]
[{"$f":"'import danych'!A88","v":"2012-10-25"},{"$f":"'import danych'!B88","v":"13:23"},{"$f":"IF('import danych'!$I88=\"LINDE 01\",MAX(C$1:C82)+1,\"\")","v":32},{"$f":"IF('import danych'!$I88=\"LINDE 02\",MAX(D$1:D82)+1,\"\")","v":""},{"$f":"IF('import danych'!$I88=\"LINDE 03\",MAX(E$1:E82)+1,\"\")","v":""},{"$f":"IF('import danych'!$I88=\"YALE 04\",MAX(F$1:F82)+1,\"\")","v":""},{"$f":"IF('import danych'!$I88=\"SUR\",MAX(G$1:G82)+1,\"\")","v":""},{"$f":"IF('import danych'!$I88=\"SMP\",MAX(H$1:H82)+1,\"\")","v":""},{"$f":"IF('import danych'!D88=\"\",\"\",LOOKUP('import danych'!F88,#REF!,#REF!))","v":{"$error":"#REF!"}}]
[{"$f":"'import danych'!A89","v":"2012-10-26"},{"$f":"'import danych'!B89","v":"11:16"},{"$f":"IF('import danych'!$I89=\"LINDE 01\",MAX(C$1:C83)+1,\"\")","v":""},{"$f":"IF('import danych'!$I89=\"LINDE 02\",MAX(D$1:D83)+1,\"\")","v":34},{"$f":"IF('import danych'!$I89=\"LINDE 03\",MAX(E$1:E83)+1,\"\")","v":""},{"$f":"IF('import danych'!$I89=\"YALE 04\",MAX(F$1:F83)+1,\"\")","v":""},{"$f":"IF('import danych'!$I89=\"SUR\",MAX(G$1:G83)+1,\"\")","v":""},{"$f":"IF('import danych'!$I89=\"SMP\",MAX(H$1:H83)+1,\"\")","v":""},{"$f":"IF('import danych'!D89=\"\",\"\",LOOKUP('import danych'!F89,#REF!,#REF!))","v":{"$error":"#REF!"}}]
[{"$f":"'import danych'!A90","v":"2012-10-26"},{"$f":"'import danych'!B90","v":"11:56"},{"$f":"IF('import danych'!$I90=\"LINDE 01\",MAX(C$1:C84)+1,\"\")","v":""},{"$f":"IF('import danych'!$I90=\"LINDE 02\",MAX(D$1:D84)+1,\"\")","v":""},{"$f":"IF('import danych'!$I90=\"LINDE 03\",MAX(E$1:E84)+1,\"\")","v":20},{"$f":"IF('import danych'!$I90=\"YALE 04\",MAX(F$1:F84)+1,\"\")","v":""},{"$f":"IF('import danych'!$I90=\"SUR\",MAX(G$1:G84)+1,\"\")","v":""},{"$f":"IF('import danych'!$I90=\"SMP\",MAX(H$1:H84)+1,\"\")","v":""},{"$f":"IF('import danych'!D90=\"\",\"\",LOOKUP('import danych'!F90,#REF!,#REF!))","v":{"$error":"#REF!"}}]
[{"$f":"'import danych'!A91","v":"2012-10-26"},{"$f":"'import danych'!B91","v":"18:39"},{"$f":"IF('import danych'!$I91=\"LINDE 01\",MAX(C$1:C85)+1,\"\")","v":33},{"$f":"IF('import danych'!$I91=\"LINDE 02\",MAX(D$1:D85)+1,\"\")","v":""},{"$f":"IF('import danych'!$I91=\"LINDE 03\",MAX(E$1:E85)+1,\"\")","v":""},{"$f":"IF('import danych'!$I91=\"YALE 04\",MAX(F$1:F85)+1,\"\")","v":""},{"$f":"IF('import danych'!$I91=\"SUR\",MAX(G$1:G85)+1,\"\")","v":""},{"$f":"IF('import danych'!$I91=\"SMP\",MAX(H$1:H85)+1,\"\")","v":""},{"$f":"IF('import danych'!D91=\"\",\"\",LOOKUP('import danych'!F91,#REF!,#REF!))","v":{"$error":"#REF!"}}]
[{"$f":"'import danych'!A92","v":"2012-10-27"},{"$f":"'import danych'!B92","v":"13:26"},{"$f":"IF('import danych'!$I92=\"LINDE 01\",MAX(C$1:C86)+1,\"\")","v":""},{"$f":"IF('import danych'!$I92=\"LINDE 02\",MAX(D$1:D86)+1,\"\")","v":35},{"$f":"IF('import danych'!$I92=\"LINDE 03\",MAX(E$1:E86)+1,\"\")","v":""},{"$f":"IF('import danych'!$I92=\"YALE 04\",MAX(F$1:F86)+1,\"\")","v":""},{"$f":"IF('import danych'!$I92=\"SUR\",MAX(G$1:G86)+1,\"\")","v":""},{"$f":"IF('import danych'!$I92=\"SMP\",MAX(H$1:H86)+1,\"\")","v":""},{"$f":"IF('import danych'!D92=\"\",\"\",LOOKUP('import danych'!F92,#REF!,#REF!))","v":{"$error":"#REF!"}}]
[{"$f":"'import danych'!A93","v":"2012-10-28"},{"$f":"'import danych'!B93","v":"12:45"},{"$f":"IF('import danych'!$I93=\"LINDE 01\",MAX(C$1:C87)+1,\"\")","v":34},{"$f":"IF('import danych'!$I93=\"LINDE 02\",MAX(D$1:D87)+1,\"\")","v":""},{"$f":"IF('import danych'!$I93=\"LINDE 03\",MAX(E$1:E87)+1,\"\")","v":""},{"$f":"IF('import danych'!$I93=\"YALE 04\",MAX(F$1:F87)+1,\"\")","v":""},{"$f":"IF('import danych'!$I93=\"SUR\",MAX(G$1:G87)+1,\"\")","v":""},{"$f":"IF('import danych'!$I93=\"SMP\",MAX(H$1:H87)+1,\"\")","v":""},{"$f":"IF('import danych'!D93=\"\",\"\",LOOKUP('import danych'!F93,#REF!,#REF!))","v":{"$error":"#REF!"}}]
[{"$f":"'import danych'!A94","v":"2012-10-28"},{"$f":"'import danych'!B94","v":"16:21"},{"$f":"IF('import danych'!$I94=\"LINDE 01\",MAX(C$1:C88)+1,\"\")","v":""},{"$f":"IF('import danych'!$I94=\"LINDE 02\",MAX(D$1:D88)+1,\"\")","v":""},{"$f":"IF('import danych'!$I94=\"LINDE 03\",MAX(E$1:E88)+1,\"\")","v":21},{"$f":"IF('import danych'!$I94=\"YALE 04\",MAX(F$1:F88)+1,\"\")","v":""},{"$f":"IF('import danych'!$I94=\"SUR\",MAX(G$1:G88)+1,\"\")","v":""},{"$f":"IF('import danych'!$I94=\"SMP\",MAX(H$1:H88)+1,\"\")","v":""},{"$f":"IF('import danych'!D94=\"\",\"\",LOOKUP('import danych'!F94,#REF!,#REF!))","v":{"$error":"#REF!"}}]
[{"$f":"'import danych'!A95","v":"2012-10-29"},{"$f":"'import danych'!B95","v":"11:40"},{"$f":"IF('import danych'!$I95=\"LINDE 01\",MAX(C$1:C89)+1,\"\")","v":""},{"$f":"IF('import danych'!$I95=\"LINDE 02\",MAX(D$1:D89)+1,\"\")","v":36},{"$f":"IF('import danych'!$I95=\"LINDE 03\",MAX(E$1:E89)+1,\"\")","v":""},{"$f":"IF('import danych'!$I95=\"YALE 04\",MAX(F$1:F89)+1,\"\")","v":""},{"$f":"IF('import danych'!$I95=\"SUR\",MAX(G$1:G89)+1,\"\")","v":""},{"$f":"IF('import danych'!$I95=\"SMP\",MAX(H$1:H89)+1,\"\")","v":""},{"$f":"IF('import danych'!D95=\"\",\"\",LOOKUP('import danych'!F95,#REF!,#REF!))","v":{"$error":"#REF!"}}]
[{"$f":"'import danych'!A96","v":"2012-10-29"},{"$f":"'import danych'!B96","v":"13:54"},{"$f":"IF('import danych'!$I96=\"LINDE 01\",MAX(C$1:C90)+1,\"\")","v":35},{"$f":"IF('import danych'!$I96=\"LINDE 02\",MAX(D$1:D90)+1,\"\")","v":""},{"$f":"IF('import danych'!$I96=\"LINDE 03\",MAX(E$1:E90)+1,\"\")","v":""},{"$f":"IF('import danych'!$I96=\"YALE 04\",MAX(F$1:F90)+1,\"\")","v":""},{"$f":"IF('import danych'!$I96=\"SUR\",MAX(G$1:G90)+1,\"\")","v":""},{"$f":"IF('import danych'!$I96=\"SMP\",MAX(H$1:H90)+1,\"\")","v":""},{"$f":"IF('import danych'!D96=\"\",\"\",LOOKUP('import danych'!F96,#REF!,#REF!))","v":{"$error":"#REF!"}}]
[{"$f":"'import danych'!A97","v":"2012-10-30"},{"$f":"'import danych'!B97","v":"08:26"},{"$f":"IF('import danych'!$I97=\"LINDE 01\",MAX(C$1:C91)+1,\"\")","v":""},{"$f":"IF('import danych'!$I97=\"LINDE 02\",MAX(D$1:D91)+1,\"\")","v":37},{"$f":"IF('import danych'!$I97=\"LINDE 03\",MAX(E$1:E91)+1,\"\")","v":""},{"$f":"IF('import danych'!$I97=\"YALE 04\",MAX(F$1:F91)+1,\"\")","v":""},{"$f":"IF('import danych'!$I97=\"SUR\",MAX(G$1:G91)+1,\"\")","v":""},{"$f":"IF('import danych'!$I97=\"SMP\",MAX(H$1:H91)+1,\"\")","v":""},{"$f":"IF('import danych'!D97=\"\",\"\",LOOKUP('import danych'!F97,#REF!,#REF!))","v":{"$error":"#REF!"}}]
[{"$f":"'import danych'!A98","v":"2012-10-30"},{"$f":"'import danych'!B98","v":"12:59"},{"$f":"IF('import danych'!$I98=\"LINDE 01\",MAX(C$1:C92)+1,\"\")","v":""},{"$f":"IF('import danych'!$I98=\"LINDE 02\",MAX(D$1:D92)+1,\"\")","v":""},{"$f":"IF('import danych'!$I98=\"LINDE 03\",MAX(E$1:E92)+1,\"\")","v":""},{"$f":"IF('import danych'!$I98=\"YALE 04\",MAX(F$1:F92)+1,\"\")","v":""},{"$f":"IF('import danych'!$I98=\"SUR\",MAX(G$1:G92)+1,\"\")","v":""},{"$f":"IF('import danych'!$I98=\"SMP\",MAX(H$1:H92)+1,\"\")","v":9},"SK 3697V"]
[{"$f":"'import danych'!A99","v":"2012-10-30"},{"$f":"'import danych'!B99","v":"14:15"},{"$f":"IF('import danych'!$I99=\"LINDE 01\",MAX(C$1:C93)+1,\"\")","v":36},{"$f":"IF('import danych'!$I99=\"LINDE 02\",MAX(D$1:D93)+1,\"\")","v":""},{"$f":"IF('import danych'!$I99=\"LINDE 03\",MAX(E$1:E93)+1,\"\")","v":""},{"$f":"IF('import danych'!$I99=\"YALE 04\",MAX(F$1:F93)+1,\"\")","v":""},{"$f":"IF('import danych'!$I99=\"SUR\",MAX(G$1:G93)+1,\"\")","v":""},{"$f":"IF('import danych'!$I99=\"SMP\",MAX(H$1:H93)+1,\"\")","v":""},{"$f":"IF('import danych'!D99=\"\",\"\",LOOKUP('import danych'!F99,#REF!,#REF!))","v":{"$error":"#REF!"}}]
[{"$f":"'import danych'!A100","v":"2012-10-30"},{"$f":"'import danych'!B100","v":"14:23"},{"$f":"IF('import danych'!$I100=\"LINDE 01\",MAX(C$1:C94)+1,\"\")","v":""},{"$f":"IF('import danych'!$I100=\"LINDE 02\",MAX(D$1:D94)+1,\"\")","v":""},{"$f":"IF('import danych'!$I100=\"LINDE 03\",MAX(E$1:E94)+1,\"\")","v":22},{"$f":"IF('import danych'!$I100=\"YALE 04\",MAX(F$1:F94)+1,\"\")","v":""},{"$f":"IF('import danych'!$I100=\"SUR\",MAX(G$1:G94)+1,\"\")","v":""},{"$f":"IF('import danych'!$I100=\"SMP\",MAX(H$1:H94)+1,\"\")","v":""},{"$f":"IF('import danych'!D100=\"\",\"\",LOOKUP('import danych'!F100,#REF!,#REF!))","v":{"$error":"#REF!"}}]
[{"$f":"'import danych'!A101","v":"2012-10-31"},{"$f":"'import danych'!B101","v":"09:55"},{"$f":"IF('import danych'!$I101=\"LINDE 01\",MAX(C$1:C95)+1,\"\")","v":37},{"$f":"IF('import danych'!$I101=\"LINDE 02\",MAX(D$1:D95)+1,\"\")","v":""},{"$f":"IF('import danych'!$I101=\"LINDE 03\",MAX(E$1:E95)+1,\"\")","v":""},{"$f":"IF('import danych'!$I101=\"YALE 04\",MAX(F$1:F95)+1,\"\")","v":""},{"$f":"IF('import danych'!$I101=\"SUR\",MAX(G$1:G95)+1,\"\")","v":""},{"$f":"IF('import danych'!$I101=\"SMP\",MAX(H$1:H95)+1,\"\")","v":""},{"$f":"IF('import danych'!D101=\"\",\"\",LOOKUP('import danych'!F101,#REF!,#REF!))","v":{"$error":"#REF!"}}]
[{"$f":"'import danych'!A102","v":"2012-10-31"},{"$f":"'import danych'!B102","v":"11:01"},{"$f":"IF('import danych'!$I102=\"LINDE 01\",MAX(C$1:C96)+1,\"\")","v":""},{"$f":"IF('import danych'!$I102=\"LINDE 02\",MAX(D$1:D96)+1,\"\")","v":""},{"$f":"IF('import danych'!$I102=\"LINDE 03\",MAX(E$1:E96)+1,\"\")","v":""},{"$f":"IF('import danych'!$I102=\"YALE 04\",MAX(F$1:F96)+1,\"\")","v":""},{"$f":"IF('import danych'!$I102=\"SUR\",MAX(G$1:G96)+1,\"\")","v":""},{"$f":"IF('import danych'!$I102=\"SMP\",MAX(H$1:H96)+1,\"\")","v":10},{"$f":"IF('import danych'!D102=\"\",\"\",LOOKUP('import danych'!F102,#REF!,#REF!))","v":{"$error":"#REF!"}}]
[{"$f":"'import danych'!A103","v":"2012-10-31"},{"$f":"'import danych'!B103","v":"11:59"},{"$f":"IF('import danych'!$I103=\"LINDE 01\",MAX(C$1:C97)+1,\"\")","v":""},{"$f":"IF('import danych'!$I103=\"LINDE 02\",MAX(D$1:D97)+1,\"\")","v":38},{"$f":"IF('import danych'!$I103=\"LINDE 03\",MAX(E$1:E97)+1,\"\")","v":""},{"$f":"IF('import danych'!$I103=\"YALE 04\",MAX(F$1:F97)+1,\"\")","v":""},{"$f":"IF('import danych'!$I103=\"SUR\",MAX(G$1:G97)+1,\"\")","v":""},{"$f":"IF('import danych'!$I103=\"SMP\",MAX(H$1:H97)+1,\"\")","v":""},{"$f":"IF('import danych'!D103=\"\",\"\",LOOKUP('import danych'!F103,#REF!,#REF!))","v":{"$error":"#REF!"}}]
[{"$f":"'import danych'!A104","v":"2012-11-01"},{"$f":"'import danych'!B104","v":"14:06"},{"$f":"IF('import danych'!$I104=\"LINDE 01\",MAX(C$1:C98)+1,\"\")","v":38},{"$f":"IF('import danych'!$I104=\"LINDE 02\",MAX(D$1:D98)+1,\"\")","v":""},{"$f":"IF('import danych'!$I104=\"LINDE 03\",MAX(E$1:E98)+1,\"\")","v":""},{"$f":"IF('import danych'!$I104=\"YALE 04\",MAX(F$1:F98)+1,\"\")","v":""},{"$f":"IF('import danych'!$I104=\"SUR\",MAX(G$1:G98)+1,\"\")","v":""},{"$f":"IF('import danych'!$I104=\"SMP\",MAX(H$1:H98)+1,\"\")","v":""},{"$f":"IF('import danych'!D104=\"\",\"\",LOOKUP('import danych'!F104,#REF!,#REF!))","v":{"$error":"#REF!"}}]
[{"$f":"'import danych'!A105","v":"2012-11-02"},{"$f":"'import danych'!B105","v":"13:21"},{"$f":"IF('import danych'!$I105=\"LINDE 01\",MAX(C$1:C99)+1,\"\")","v":""},{"$f":"IF('import danych'!$I105=\"LINDE 02\",MAX(D$1:D99)+1,\"\")","v":39},{"$f":"IF('import danych'!$I105=\"LINDE 03\",MAX(E$1:E99)+1,\"\")","v":""},{"$f":"IF('import danych'!$I105=\"YALE 04\",MAX(F$1:F99)+1,\"\")","v":""},{"$f":"IF('import danych'!$I105=\"SUR\",MAX(G$1:G99)+1,\"\")","v":""},{"$f":"IF('import danych'!$I105=\"SMP\",MAX(H$1:H99)+1,\"\")","v":""},{"$f":"IF('import danych'!D105=\"\",\"\",LOOKUP('import danych'!F105,#REF!,#REF!))","v":{"$error":"#REF!"}}]
[{"$f":"'import danych'!A106","v":""},{"$f":"'import danych'!B106","v":""},{"$f":"IF('import danych'!$I106=\"LINDE 01\",MAX(C$1:C100)+1,\"\")","v":""},{"$f":"IF('import danych'!$I106=\"LINDE 02\",MAX(D$1:D100)+1,\"\")","v":""},{"$f":"IF('import danych'!$I106=\"LINDE 03\",MAX(E$1:E100)+1,\"\")","v":""},{"$f":"IF('import danych'!$I106=\"YALE 04\",MAX(F$1:F100)+1,\"\")","v":""},{"$f":"IF('import danych'!$I106=\"SUR\",MAX(G$1:G100)+1,\"\")","v":""},{"$f":"IF('import danych'!$I106=\"SMP\",MAX(H$1:H100)+1,\"\")","v":""},{"$f":"IF('import danych'!D106=\"\",\"\",LOOKUP('import danych'!F106,#REF!,#REF!))","v":""}]
[{"$f":"'import danych'!A107","v":""},{"$f":"'import danych'!B107","v":""},{"$f":"IF('import danych'!$I107=\"LINDE 01\",MAX(C$1:C101)+1,\"\")","v":""},{"$f":"IF('import danych'!$I107=\"LINDE 02\",MAX(D$1:D101)+1,\"\")","v":""},{"$f":"IF('import danych'!$I107=\"LINDE 03\",MAX(E$1:E101)+1,\"\")","v":""},{"$f":"IF('import danych'!$I107=\"YALE 04\",MAX(F$1:F101)+1,\"\")","v":""},{"$f":"IF('import danych'!$I107=\"SUR\",MAX(G$1:G101)+1,\"\")","v":""},{"$f":"IF('import danych'!$I107=\"SMP\",MAX(H$1:H101)+1,\"\")","v":""},{"$f":"IF('import danych'!D107=\"\",\"\",LOOKUP('import danych'!F107,#REF!,#REF!))","v":""}]
[{"$f":"'import danych'!A108","v":""},{"$f":"'import danych'!B108","v":""},{"$f":"IF('import danych'!$I108=\"LINDE 01\",MAX(C$1:C102)+1,\"\")","v":""},{"$f":"IF('import danych'!$I108=\"LINDE 02\",MAX(D$1:D102)+1,\"\")","v":""},{"$f":"IF('import danych'!$I108=\"LINDE 03\",MAX(E$1:E102)+1,\"\")","v":""},{"$f":"IF('import danych'!$I108=\"YALE 04\",MAX(F$1:F102)+1,\"\")","v":""},{"$f":"IF('import danych'!$I108=\"SUR\",MAX(G$1:G102)+1,\"\")","v":""},{"$f":"IF('import danych'!$I108=\"SMP\",MAX(H$1:H102)+1,\"\")","v":""},{"$f":"IF('import danych'!D108=\"\",\"\",LOOKUP('import danych'!F108,#REF!,#REF!))","v":""}]
[{"$f":"'import danych'!A109","v":""},{"$f":"'import danych'!B109","v":""},{"$f":"IF('import danych'!$I109=\"LINDE 01\",MAX(C$1:C103)+1,\"\")","v":""},{"$f":"IF('import danych'!$I109=\"LINDE 02\",MAX(D$1:D103)+1,\"\")","v":""},{"$f":"IF('import danych'!$I109=\"LINDE 03\",MAX(E$1:E103)+1,\"\")","v":""},{"$f":"IF('import danych'!$I109=\"YALE 04\",MAX(F$1:F103)+1,\"\")","v":""},{"$f":"IF('import danych'!$I109=\"SUR\",MAX(G$1:G103)+1,\"\")","v":""},{"$f":"IF('import danych'!$I109=\"SMP\",MAX(H$1:H103)+1,\"\")","v":""},{"$f":"IF('import danych'!D109=\"\",\"\",LOOKUP('import danych'!F109,#REF!,#REF!))","v":""}]
[{"$f":"'import danych'!A110","v":""},{"$f":"'import danych'!B110","v":""},{"$f":"IF('import danych'!$I110=\"LINDE 01\",MAX(C$1:C104)+1,\"\")","v":""},{"$f":"IF('import danych'!$I110=\"LINDE 02\",MAX(D$1:D104)+1,\"\")","v":""},{"$f":"IF('import danych'!$I110=\"LINDE 03\",MAX(E$1:E104)+1,\"\")","v":""},{"$f":"IF('import danych'!$I110=\"YALE 04\",MAX(F$1:F104)+1,\"\")","v":""},{"$f":"IF('import danych'!$I110=\"SUR\",MAX(G$1:G104)+1,\"\")","v":""},{"$f":"IF('import danych'!$I110=\"SMP\",MAX(H$1:H104)+1,\"\")","v":""},{"$f":"IF('import danych'!D110=\"\",\"\",LOOKUP('import danych'!F110,#REF!,#REF!))","v":""}]
[{"$f":"'import danych'!A111","v":""},{"$f":"'import danych'!B111","v":""},{"$f":"IF('import danych'!$I111=\"LINDE 01\",MAX(C$1:C105)+1,\"\")","v":""},{"$f":"IF('import danych'!$I111=\"LINDE 02\",MAX(D$1:D105)+1,\"\")","v":""},{"$f":"IF('import danych'!$I111=\"LINDE 03\",MAX(E$1:E105)+1,\"\")","v":""},{"$f":"IF('import danych'!$I111=\"YALE 04\",MAX(F$1:F105)+1,\"\")","v":""},{"$f":"IF('import danych'!$I111=\"SUR\",MAX(G$1:G105)+1,\"\")","v":""},{"$f":"IF('import danych'!$I111=\"SMP\",MAX(H$1:H105)+1,\"\")","v":""},{"$f":"IF('import danych'!D111=\"\",\"\",LOOKUP('import danych'!F111,#REF!,#REF!))","v":""}]
[{"$f":"'import danych'!A112","v":""},{"$f":"'import danych'!B112","v":""},{"$f":"IF('import danych'!$I112=\"LINDE 01\",MAX(C$1:C106)+1,\"\")","v":""},{"$f":"IF('import danych'!$I112=\"LINDE 02\",MAX(D$1:D106)+1,\"\")","v":""},{"$f":"IF('import danych'!$I112=\"LINDE 03\",MAX(E$1:E106)+1,\"\")","v":""},{"$f":"IF('import danych'!$I112=\"YALE 04\",MAX(F$1:F106)+1,\"\")","v":""},{"$f":"IF('import danych'!$I112=\"SUR\",MAX(G$1:G106)+1,\"\")","v":""},{"$f":"IF('import danych'!$I112=\"SMP\",MAX(H$1:H106)+1,\"\")","v":""},{"$f":"IF('import danych'!D112=\"\",\"\",LOOKUP('import danych'!F112,#REF!,#REF!))","v":""}]
[{"$f":"'import danych'!A113","v":""},{"$f":"'import danych'!B113","v":""},{"$f":"IF('import danych'!$I113=\"LINDE 01\",MAX(C$1:C107)+1,\"\")","v":""},{"$f":"IF('import danych'!$I113=\"LINDE 02\",MAX(D$1:D107)+1,\"\")","v":""},{"$f":"IF('import danych'!$I113=\"LINDE 03\",MAX(E$1:E107)+1,\"\")","v":""},{"$f":"IF('import danych'!$I113=\"YALE 04\",MAX(F$1:F107)+1,\"\")","v":""},{"$f":"IF('import danych'!$I113=\"SUR\",MAX(G$1:G107)+1,\"\")","v":""},{"$f":"IF('import danych'!$I113=\"SMP\",MAX(H$1:H107)+1,\"\")","v":""},{"$f":"IF('import danych'!D113=\"\",\"\",LOOKUP('import danych'!F113,#REF!,#REF!))","v":""}]
[{"$f":"'import danych'!A114","v":""},{"$f":"'import danych'!B114","v":""},{"$f":"IF('import danych'!$I114=\"LINDE 01\",MAX(C$1:C108)+1,\"\")","v":""},{"$f":"IF('import danych'!$I114=\"LINDE 02\",MAX(D$1:D108)+1,\"\")","v":""},{"$f":"IF('import danych'!$I114=\"LINDE 03\",MAX(E$1:E108)+1,\"\")","v":""},{"$f":"IF('import danych'!$I114=\"YALE 04\",MAX(F$1:F108)+1,\"\")","v":""},{"$f":"IF('import danych'!$I114=\"SUR\",MAX(G$1:G108)+1,\"\")","v":""},{"$f":"IF('import danych'!$I114=\"SMP\",MAX(H$1:H108)+1,\"\")","v":""},{"$f":"IF('import danych'!D114=\"\",\"\",LOOKUP('import danych'!F114,#REF!,#REF!))","v":""}]
[{"$f":"'import danych'!A115","v":""},{"$f":"'import danych'!B115","v":""},{"$f":"IF('import danych'!$I115=\"LINDE 01\",MAX(C$1:C109)+1,\"\")","v":""},{"$f":"IF('import danych'!$I115=\"LINDE 02\",MAX(D$1:D109)+1,\"\")","v":""},{"$f":"IF('import danych'!$I115=\"LINDE 03\",MAX(E$1:E109)+1,\"\")","v":""},{"$f":"IF('import danych'!$I115=\"YALE 04\",MAX(F$1:F109)+1,\"\")","v":""},{"$f":"IF('import danych'!$I115=\"SUR\",MAX(G$1:G109)+1,\"\")","v":""},{"$f":"IF('import danych'!$I115=\"SMP\",MAX(H$1:H109)+1,\"\")","v":""},{"$f":"IF('import danych'!D115=\"\",\"\",LOOKUP('import danych'!F115,#REF!,#REF!))","v":""}]
[{"$f":"'import danych'!A116","v":""},{"$f":"'import danych'!B116","v":""},{"$f":"IF('import danych'!$I116=\"LINDE 01\",MAX(C$1:C110)+1,\"\")","v":""},{"$f":"IF('import danych'!$I116=\"LINDE 02\",MAX(D$1:D110)+1,\"\")","v":""},{"$f":"IF('import danych'!$I116=\"LINDE 03\",MAX(E$1:E110)+1,\"\")","v":""},{"$f":"IF('import danych'!$I116=\"YALE 04\",MAX(F$1:F110)+1,\"\")","v":""},{"$f":"IF('import danych'!$I116=\"SUR\",MAX(G$1:G110)+1,\"\")","v":""},{"$f":"IF('import danych'!$I116=\"SMP\",MAX(H$1:H110)+1,\"\")","v":""},{"$f":"IF('import danych'!D116=\"\",\"\",LOOKUP('import danych'!F116,#REF!,#REF!))","v":""}]
[{"$f":"'import danych'!A117","v":""},{"$f":"'import danych'!B117","v":""},{"$f":"IF('import danych'!$I117=\"LINDE 01\",MAX(C$1:C111)+1,\"\")","v":""},{"$f":"IF('import danych'!$I117=\"LINDE 02\",MAX(D$1:D111)+1,\"\")","v":""},{"$f":"IF('import danych'!$I117=\"LINDE 03\",MAX(E$1:E111)+1,\"\")","v":""},{"$f":"IF('import danych'!$I117=\"YALE 04\",MAX(F$1:F111)+1,\"\")","v":""},{"$f":"IF('import danych'!$I117=\"SUR\",MAX(G$1:G111)+1,\"\")","v":""},{"$f":"IF('import danych'!$I117=\"SMP\",MAX(H$1:H111)+1,\"\")","v":""},{"$f":"IF('import danych'!D117=\"\",\"\",LOOKUP('import danych'!F117,#REF!,#REF!))","v":""}]
[null,null,{"$f":"IF('import danych'!$I118=\"LINDE 01\",MAX(C$1:C112)+1,\"\")","v":""},{"$f":"IF('import danych'!$I118=\"LINDE 02\",MAX(D$1:D112)+1,\"\")","v":""},{"$f":"IF('import danych'!$I118=\"LINDE 03\",MAX(E$1:E112)+1,\"\")","v":""},{"$f":"IF('import danych'!$I118=\"YALE 04\",MAX(F$1:F112)+1,\"\")","v":""},{"$f":"IF('import danych'!$I118=\"SUR\",MAX(G$1:G112)+1,\"\")","v":""},{"$f":"IF('import danych'!$I118=\"SMP\",MAX(H$1:H112)+1,\"\")","v":""},{"$f":"IF('import danych'!D118=\"\",\"\",LOOKUP('import danych'!F118,#REF!,#REF!))","v":""}]
[null,null,{"$f":"IF('import danych'!$I119=\"LINDE 01\",MAX(C$1:C113)+1,\"\")","v":""},{"$f":"IF('import danych'!$I119=\"LINDE 02\",MAX(D$1:D113)+1,\"\")","v":""},{"$f":"IF('import danych'!$I119=\"LINDE 03\",MAX(E$1:E113)+1,\"\")","v":""},{"$f":"IF('import danych'!$I119=\"YALE 04\",MAX(F$1:F113)+1,\"\")","v":""},{"$f":"IF('import danych'!$I119=\"SUR\",MAX(G$1:G113)+1,\"\")","v":""},{"$f":"IF('import danych'!$I119=\"SMP\",MAX(H$1:H113)+1,\"\")","v":""},{"$f":"IF('import danych'!D119=\"\",\"\",LOOKUP('import danych'!F119,#REF!,#REF!))","v":""}]
[null,null,{"$f":"IF('import danych'!$I120=\"LINDE 01\",MAX(C$1:C114)+1,\"\")","v":""},{"$f":"IF('import danych'!$I120=\"LINDE 02\",MAX(D$1:D114)+1,\"\")","v":""},{"$f":"IF('import danych'!$I120=\"LINDE 03\",MAX(E$1:E114)+1,\"\")","v":""},{"$f":"IF('import danych'!$I120=\"YALE 04\",MAX(F$1:F114)+1,\"\")","v":""},{"$f":"IF('import danych'!$I120=\"SUR\",MAX(G$1:G114)+1,\"\")","v":""},{"$f":"IF('import danych'!$I120=\"SMP\",MAX(H$1:H114)+1,\"\")","v":""},{"$f":"IF('import danych'!D120=\"\",\"\",LOOKUP('import danych'!F120,#REF!,#REF!))","v":""}]
[null,null,{"$f":"IF('import danych'!$I121=\"LINDE 01\",MAX(C$1:C115)+1,\"\")","v":""},{"$f":"IF('import danych'!$I121=\"LINDE 02\",MAX(D$1:D115)+1,\"\")","v":""},{"$f":"IF('import danych'!$I121=\"LINDE 03\",MAX(E$1:E115)+1,\"\")","v":""},{"$f":"IF('import danych'!$I121=\"YALE 04\",MAX(F$1:F115)+1,\"\")","v":""},{"$f":"IF('import danych'!$I121=\"SUR\",MAX(G$1:G115)+1,\"\")","v":""},{"$f":"IF('import danych'!$I121=\"SMP\",MAX(H$1:H115)+1,\"\")","v":""},{"$f":"IF('import danych'!D121=\"\",\"\",LOOKUP('import danych'!F121,#REF!,#REF!))","v":""}]
[null,null,{"$f":"IF('import danych'!$I122=\"LINDE 01\",MAX(C$1:C116)+1,\"\")","v":""},{"$f":"IF('import danych'!$I122=\"LINDE 02\",MAX(D$1:D116)+1,\"\")","v":""},{"$f":"IF('import danych'!$I122=\"LINDE 03\",MAX(E$1:E116)+1,\"\")","v":""},{"$f":"IF('import danych'!$I122=\"YALE 04\",MAX(F$1:F116)+1,\"\")","v":""},{"$f":"IF('import danych'!$I122=\"SUR\",MAX(G$1:G116)+1,\"\")","v":""},{"$f":"IF('import danych'!$I122=\"SMP\",MAX(H$1:H116)+1,\"\")","v":""},{"$f":"IF('import danych'!D122=\"\",\"\",LOOKUP('import danych'!F122,#REF!,#REF!))","v":""}]
[null,null,{"$f":"IF('import danych'!$I123=\"LINDE 01\",MAX(C$1:C117)+1,\"\")","v":""},{"$f":"IF('import danych'!$I123=\"LINDE 02\",MAX(D$1:D117)+1,\"\")","v":""},{"$f":"IF('import danych'!$I123=\"LINDE 03\",MAX(E$1:E117)+1,\"\")","v":""},{"$f":"IF('import danych'!$I123=\"YALE 04\",MAX(F$1:F117)+1,\"\")","v":""},{"$f":"IF('import danych'!$I123=\"SUR\",MAX(G$1:G117)+1,\"\")","v":""},{"$f":"IF('import danych'!$I123=\"SMP\",MAX(H$1:H117)+1,\"\")","v":""},{"$f":"IF('import danych'!D123=\"\",\"\",LOOKUP('import danych'!F123,#REF!,#REF!))","v":""}]
[null,null,{"$f":"IF('import danych'!$I124=\"LINDE 01\",MAX(C$1:C118)+1,\"\")","v":""},{"$f":"IF('import danych'!$I124=\"LINDE 02\",MAX(D$1:D118)+1,\"\")","v":""},{"$f":"IF('import danych'!$I124=\"LINDE 03\",MAX(E$1:E118)+1,\"\")","v":""},{"$f":"IF('import danych'!$I124=\"YALE 04\",MAX(F$1:F118)+1,\"\")","v":""},{"$f":"IF('import danych'!$I124=\"SUR\",MAX(G$1:G118)+1,\"\")","v":""},{"$f":"IF('import danych'!$I124=\"SMP\",MAX(H$1:H118)+1,\"\")","v":""},{"$f":"IF('import danych'!D124=\"\",\"\",LOOKUP('import danych'!F124,#REF!,#REF!))","v":""}]
[null,null,{"$f":"IF('import danych'!$I125=\"LINDE 01\",MAX(C$1:C119)+1,\"\")","v":""},{"$f":"IF('import danych'!$I125=\"LINDE 02\",MAX(D$1:D119)+1,\"\")","v":""},{"$f":"IF('import danych'!$I125=\"LINDE 03\",MAX(E$1:E119)+1,\"\")","v":""},{"$f":"IF('import danych'!$I125=\"YALE 04\",MAX(F$1:F119)+1,\"\")","v":""},{"$f":"IF('import danych'!$I125=\"SUR\",MAX(G$1:G119)+1,\"\")","v":""},{"$f":"IF('import danych'!$I125=\"SMP\",MAX(H$1:H119)+1,\"\")","v":""},{"$f":"IF('import danych'!D125=\"\",\"\",LOOKUP('import danych'!F125,#REF!,#REF!))","v":""}]
[null,null,{"$f":"IF('import danych'!$I126=\"LINDE 01\",MAX(C$1:C120)+1,\"\")","v":""},{"$f":"IF('import danych'!$I126=\"LINDE 02\",MAX(D$1:D120)+1,\"\")","v":""},{"$f":"IF('import danych'!$I126=\"LINDE 03\",MAX(E$1:E120)+1,\"\")","v":""},{"$f":"IF('import danych'!$I126=\"YALE 04\",MAX(F$1:F120)+1,\"\")","v":""},{"$f":"IF('import danych'!$I126=\"SUR\",MAX(G$1:G120)+1,\"\")","v":""},{"$f":"IF('import danych'!$I126=\"SMP\",MAX(H$1:H120)+1,\"\")","v":""},{"$f":"IF('import danych'!D126=\"\",\"\",LOOKUP('import danych'!F126,#REF!,#REF!))","v":""}]
[null,null,{"$f":"IF('import danych'!$I127=\"LINDE 01\",MAX(C$1:C121)+1,\"\")","v":""},{"$f":"IF('import danych'!$I127=\"LINDE 02\",MAX(D$1:D121)+1,\"\")","v":""},{"$f":"IF('import danych'!$I127=\"LINDE 03\",MAX(E$1:E121)+1,\"\")","v":""},{"$f":"IF('import danych'!$I127=\"YALE 04\",MAX(F$1:F121)+1,\"\")","v":""},{"$f":"IF('import danych'!$I127=\"SUR\",MAX(G$1:G121)+1,\"\")","v":""},{"$f":"IF('import danych'!$I127=\"SMP\",MAX(H$1:H121)+1,\"\")","v":""},{"$f":"IF('import danych'!D127=\"\",\"\",LOOKUP('import danych'!F127,#REF!,#REF!))","v":""}]
[null,null,{"$f":"IF('import danych'!$I128=\"LINDE 01\",MAX(C$1:C122)+1,\"\")","v":""},{"$f":"IF('import danych'!$I128=\"LINDE 02\",MAX(D$1:D122)+1,\"\")","v":""},{"$f":"IF('import danych'!$I128=\"LINDE 03\",MAX(E$1:E122)+1,\"\")","v":""},{"$f":"IF('import danych'!$I128=\"YALE 04\",MAX(F$1:F122)+1,\"\")","v":""},{"$f":"IF('import danych'!$I128=\"SUR\",MAX(G$1:G122)+1,\"\")","v":""},{"$f":"IF('import danych'!$I128=\"SMP\",MAX(H$1:H122)+1,\"\")","v":""},{"$f":"IF('import danych'!D128=\"\",\"\",LOOKUP('import danych'!F128,#REF!,#REF!))","v":""}]
[null,null,{"$f":"IF('import danych'!$I129=\"LINDE 01\",MAX(C$1:C123)+1,\"\")","v":""},{"$f":"IF('import danych'!$I129=\"LINDE 02\",MAX(D$1:D123)+1,\"\")","v":""},{"$f":"IF('import danych'!$I129=\"LINDE 03\",MAX(E$1:E123)+1,\"\")","v":""},{"$f":"IF('import danych'!$I129=\"YALE 04\",MAX(F$1:F123)+1,\"\")","v":""},{"$f":"IF('import danych'!$I129=\"SUR\",MAX(G$1:G123)+1,\"\")","v":""},{"$f":"IF('import danych'!$I129=\"SMP\",MAX(H$1:H123)+1,\"\")","v":""},{"$f":"IF('import danych'!D129=\"\",\"\",LOOKUP('import danych'!F129,#REF!,#REF!))","v":""}]
[null,null,{"$f":"IF('import danych'!$I130=\"LINDE 01\",MAX(C$1:C124)+1,\"\")","v":""},{"$f":"IF('import danych'!$I130=\"LINDE 02\",MAX(D$1:D124)+1,\"\")","v":""},{"$f":"IF('import danych'!$I130=\"LINDE 03\",MAX(E$1:E124)+1,\"\")","v":""},{"$f":"IF('import danych'!$I130=\"YALE 04\",MAX(F$1:F124)+1,\"\")","v":""},{"$f":"IF('import danych'!$I130=\"SUR\",MAX(G$1:G124)+1,\"\")","v":""},{"$f":"IF('import danych'!$I130=\"SMP\",MAX(H$1:H124)+1,\"\")","v":""},{"$f":"IF('import danych'!D130=\"\",\"\",LOOKUP('import danych'!F130,#REF!,#REF!))","v":""}]
[null,null,{"$f":"IF('import danych'!$I131=\"LINDE 01\",MAX(C$1:C125)+1,\"\")","v":""},{"$f":"IF('import danych'!$I131=\"LINDE 02\",MAX(D$1:D125)+1,\"\")","v":""},{"$f":"IF('import danych'!$I131=\"LINDE 03\",MAX(E$1:E125)+1,\"\")","v":""},{"$f":"IF('import danych'!$I131=\"YALE 04\",MAX(F$1:F125)+1,\"\")","v":""},{"$f":"IF('import danych'!$I131=\"SUR\",MAX(G$1:G125)+1,\"\")","v":""},{"$f":"IF('import danych'!$I131=\"SMP\",MAX(H$1:H125)+1,\"\")","v":""},{"$f":"IF('import danych'!D131=\"\",\"\",LOOKUP('import danych'!F131,#REF!,#REF!))","v":""}]
[null,null,{"$f":"IF('import danych'!$I132=\"LINDE 01\",MAX(C$1:C126)+1,\"\")","v":""},{"$f":"IF('import danych'!$I132=\"LINDE 02\",MAX(D$1:D126)+1,\"\")","v":""},{"$f":"IF('import danych'!$I132=\"LINDE 03\",MAX(E$1:E126)+1,\"\")","v":""},{"$f":"IF('import danych'!$I132=\"YALE 04\",MAX(F$1:F126)+1,\"\")","v":""},{"$f":"IF('import danych'!$I132=\"SUR\",MAX(G$1:G126)+1,\"\")","v":""},{"$f":"IF('import danych'!$I132=\"SMP\",MAX(H$1:H126)+1,\"\")","v":""},{"$f":"IF('import danych'!D132=\"\",\"\",LOOKUP('import danych'!F132,#REF!,#REF!))","v":""}]
[null,null,{"$f":"IF('import danych'!$I133=\"LINDE 01\",MAX(C$1:C127)+1,\"\")","v":""},{"$f":"IF('import danych'!$I133=\"LINDE 02\",MAX(D$1:D127)+1,\"\")","v":""},{"$f":"IF('import danych'!$I133=\"LINDE 03\",MAX(E$1:E127)+1,\"\")","v":""},{"$f":"IF('import danych'!$I133=\"YALE 04\",MAX(F$1:F127)+1,\"\")","v":""},{"$f":"IF('import danych'!$I133=\"SUR\",MAX(G$1:G127)+1,\"\")","v":""},{"$f":"IF('import danych'!$I133=\"SMP\",MAX(H$1:H127)+1,\"\")","v":""},{"$f":"IF('import danych'!D133=\"\",\"\",LOOKUP('import danych'!F133,#REF!,#REF!))","v":""}]
[null,null,{"$f":"IF('import danych'!$I134=\"LINDE 01\",MAX(C$1:C128)+1,\"\")","v":""},{"$f":"IF('import danych'!$I134=\"LINDE 02\",MAX(D$1:D128)+1,\"\")","v":""},{"$f":"IF('import danych'!$I134=\"LINDE 03\",MAX(E$1:E128)+1,\"\")","v":""},{"$f":"IF('import danych'!$I134=\"YALE 04\",MAX(F$1:F128)+1,\"\")","v":""},{"$f":"IF('import danych'!$I134=\"SUR\",MAX(G$1:G128)+1,\"\")","v":""},{"$f":"IF('import danych'!$I134=\"SMP\",MAX(H$1:H128)+1,\"\")","v":""},{"$f":"IF('import danych'!D134=\"\",\"\",LOOKUP('import danych'!F134,#REF!,#REF!))","v":""}]
[null,null,{"$f":"IF('import danych'!$I135=\"LINDE 01\",MAX(C$1:C129)+1,\"\")","v":""},{"$f":"IF('import danych'!$I135=\"LINDE 02\",MAX(D$1:D129)+1,\"\")","v":""},{"$f":"IF('import danych'!$I135=\"LINDE 03\",MAX(E$1:E129)+1,\"\")","v":""},{"$f":"IF('import danych'!$I135=\"YALE 04\",MAX(F$1:F129)+1,\"\")","v":""},{"$f":"IF('import danych'!$I135=\"SUR\",MAX(G$1:G129)+1,\"\")","v":""},{"$f":"IF('import danych'!$I135=\"SMP\",MAX(H$1:H129)+1,\"\")","v":""},{"$f":"IF('import danych'!D135=\"\",\"\",LOOKUP('import danych'!F135,#REF!,#REF!))","v":""}]
[null,null,{"$f":"IF('import danych'!$I136=\"LINDE 01\",MAX(C$1:C130)+1,\"\")","v":""},{"$f":"IF('import danych'!$I136=\"LINDE 02\",MAX(D$1:D130)+1,\"\")","v":""},{"$f":"IF('import danych'!$I136=\"LINDE 03\",MAX(E$1:E130)+1,\"\")","v":""},{"$f":"IF('import danych'!$I136=\"YALE 04\",MAX(F$1:F130)+1,\"\")","v":""},{"$f":"IF('import danych'!$I136=\"SUR\",MAX(G$1:G130)+1,\"\")","v":""},{"$f":"IF('import danych'!$I136=\"SMP\",MAX(H$1:H130)+1,\"\")","v":""},{"$f":"IF('import danych'!D136=\"\",\"\",LOOKUP('import danych'!F136,#REF!,#REF!))","v":""}]
[null,null,{"$f":"IF('import danych'!$I137=\"LINDE 01\",MAX(C$1:C131)+1,\"\")","v":""},{"$f":"IF('import danych'!$I137=\"LINDE 02\",MAX(D$1:D131)+1,\"\")","v":""},{"$f":"IF('import danych'!$I137=\"LINDE 03\",MAX(E$1:E131)+1,\"\")","v":""},{"$f":"IF('import danych'!$I137=\"YALE 04\",MAX(F$1:F131)+1,\"\")","v":""},{"$f":"IF('import danych'!$I137=\"SUR\",MAX(G$1:G131)+1,\"\")","v":""},{"$f":"IF('import danych'!$I137=\"SMP\",MAX(H$1:H131)+1,\"\")","v":""},{"$f":"IF('import danych'!D137=\"\",\"\",LOOKUP('import danych'!F137,#REF!,#REF!))","v":""}]
[null,null,{"$f":"IF('import danych'!$I138=\"LINDE 01\",MAX(C$1:C132)+1,\"\")","v":""},{"$f":"IF('import danych'!$I138=\"LINDE 02\",MAX(D$1:D132)+1,\"\")","v":""},{"$f":"IF('import danych'!$I138=\"LINDE 03\",MAX(E$1:E132)+1,\"\")","v":""},{"$f":"IF('import danych'!$I138=\"YALE 04\",MAX(F$1:F132)+1,\"\")","v":""},{"$f":"IF('import danych'!$I138=\"SUR\",MAX(G$1:G132)+1,\"\")","v":""},{"$f":"IF('import danych'!$I138=\"SMP\",MAX(H$1:H132)+1,\"\")","v":""},{"$f":"IF('import danych'!D138=\"\",\"\",LOOKUP('import danych'!F138,#REF!,#REF!))","v":""}]
[null,null,{"$f":"IF('import danych'!$I139=\"LINDE 01\",MAX(C$1:C133)+1,\"\")","v":""},{"$f":"IF('import danych'!$I139=\"LINDE 02\",MAX(D$1:D133)+1,\"\")","v":""},{"$f":"IF('import danych'!$I139=\"LINDE 03\",MAX(E$1:E133)+1,\"\")","v":""},{"$f":"IF('import danych'!$I139=\"YALE 04\",MAX(F$1:F133)+1,\"\")","v":""},{"$f":"IF('import danych'!$I139=\"SUR\",MAX(G$1:G133)+1,\"\")","v":""},{"$f":"IF('import danych'!$I139=\"SMP\",MAX(H$1:H133)+1,\"\")","v":""},{"$f":"IF('import danych'!D139=\"\",\"\",LOOKUP('import danych'!F139,#REF!,#REF!))","v":""}]
[null,null,{"$f":"IF('import danych'!$I140=\"LINDE 01\",MAX(C$1:C134)+1,\"\")","v":""},{"$f":"IF('import danych'!$I140=\"LINDE 02\",MAX(D$1:D134)+1,\"\")","v":""},{"$f":"IF('import danych'!$I140=\"LINDE 03\",MAX(E$1:E134)+1,\"\")","v":""},{"$f":"IF('import danych'!$I140=\"YALE 04\",MAX(F$1:F134)+1,\"\")","v":""},{"$f":"IF('import danych'!$I140=\"SUR\",MAX(G$1:G134)+1,\"\")","v":""},{"$f":"IF('import danych'!$I140=\"SMP\",MAX(H$1:H134)+1,\"\")","v":""},{"$f":"IF('import danych'!D140=\"\",\"\",LOOKUP('import danych'!F140,#REF!,#REF!))","v":""}]
[null,null,{"$f":"IF('import danych'!$I141=\"LINDE 01\",MAX(C$1:C135)+1,\"\")","v":""},{"$f":"IF('import danych'!$I141=\"LINDE 02\",MAX(D$1:D135)+1,\"\")","v":""},{"$f":"IF('import danych'!$I141=\"LINDE 03\",MAX(E$1:E135)+1,\"\")","v":""},{"$f":"IF('import danych'!$I141=\"YALE 04\",MAX(F$1:F135)+1,\"\")","v":""},{"$f":"IF('import danych'!$I141=\"SUR\",MAX(G$1:G135)+1,\"\")","v":""},{"$f":"IF('import danych'!$I141=\"SMP\",MAX(H$1:H135)+1,\"\")","v":""},{"$f":"IF('import danych'!D141=\"\",\"\",LOOKUP('import danych'!F141,#REF!,#REF!))","v":""}]
[null,null,{"$f":"IF('import danych'!$I142=\"LINDE 01\",MAX(C$1:C136)+1,\"\")","v":""},{"$f":"IF('import danych'!$I142=\"LINDE 02\",MAX(D$1:D136)+1,\"\")","v":""},{"$f":"IF('import danych'!$I142=\"LINDE 03\",MAX(E$1:E136)+1,\"\")","v":""},{"$f":"IF('import danych'!$I142=\"YALE 04\",MAX(F$1:F136)+1,\"\")","v":""},{"$f":"IF('import danych'!$I142=\"SUR\",MAX(G$1:G136)+1,\"\")","v":""},{"$f":"IF('import danych'!$I142=\"SMP\",MAX(H$1:H136)+1,\"\")","v":""},{"$f":"IF('import danych'!D142=\"\",\"\",LOOKUP('import danych'!F142,#REF!,#REF!))","v":""}]
[null,null,{"$f":"IF('import danych'!$I143=\"LINDE 01\",MAX(C$1:C137)+1,\"\")","v":""},{"$f":"IF('import danych'!$I143=\"LINDE 02\",MAX(D$1:D137)+1,\"\")","v":""},{"$f":"IF('import danych'!$I143=\"LINDE 03\",MAX(E$1:E137)+1,\"\")","v":""},{"$f":"IF('import danych'!$I143=\"YALE 04\",MAX(F$1:F137)+1,\"\")","v":""},{"$f":"IF('import danych'!$I143=\"SUR\",MAX(G$1:G137)+1,\"\")","v":""},{"$f":"IF('import danych'!$I143=\"SMP\",MAX(H$1:H137)+1,\"\")","v":""},{"$f":"IF('import danych'!D143=\"\",\"\",LOOKUP('import danych'!F143,#REF!,#REF!))","v":""}]
[null,null,{"$f":"IF('import danych'!$I144=\"LINDE 01\",MAX(C$1:C138)+1,\"\")","v":""},{"$f":"IF('import danych'!$I144=\"LINDE 02\",MAX(D$1:D138)+1,\"\")","v":""},{"$f":"IF('import danych'!$I144=\"LINDE 03\",MAX(E$1:E138)+1,\"\")","v":""},{"$f":"IF('import danych'!$I144=\"YALE 04\",MAX(F$1:F138)+1,\"\")","v":""},{"$f":"IF('import danych'!$I144=\"SUR\",MAX(G$1:G138)+1,\"\")","v":""},{"$f":"IF('import danych'!$I144=\"SMP\",MAX(H$1:H138)+1,\"\")","v":""},{"$f":"IF('import danych'!D144=\"\",\"\",LOOKUP('import danych'!F144,#REF!,#REF!))","v":""}]
[null,null,{"$f":"IF('import danych'!$I145=\"LINDE 01\",MAX(C$1:C139)+1,\"\")","v":""},{"$f":"IF('import danych'!$I145=\"LINDE 02\",MAX(D$1:D139)+1,\"\")","v":""},{"$f":"IF('import danych'!$I145=\"LINDE 03\",MAX(E$1:E139)+1,\"\")","v":""},{"$f":"IF('import danych'!$I145=\"YALE 04\",MAX(F$1:F139)+1,\"\")","v":""},{"$f":"IF('import danych'!$I145=\"SUR\",MAX(G$1:G139)+1,\"\")","v":""},{"$f":"IF('import danych'!$I145=\"SMP\",MAX(H$1:H139)+1,\"\")","v":""},{"$f":"IF('import danych'!D145=\"\",\"\",LOOKUP('import danych'!F145,#REF!,#REF!))","v":""}]
[null,null,{"$f":"IF('import danych'!$I146=\"LINDE 01\",MAX(C$1:C140)+1,\"\")","v":""},{"$f":"IF('import danych'!$I146=\"LINDE 02\",MAX(D$1:D140)+1,\"\")","v":""},{"$f":"IF('import danych'!$I146=\"LINDE 03\",MAX(E$1:E140)+1,\"\")","v":""},{"$f":"IF('import danych'!$I146=\"YALE 04\",MAX(F$1:F140)+1,\"\")","v":""},{"$f":"IF('import danych'!$I146=\"SUR\",MAX(G$1:G140)+1,\"\")","v":""},{"$f":"IF('import danych'!$I146=\"SMP\",MAX(H$1:H140)+1,\"\")","v":""},{"$f":"IF('import danych'!D146=\"\",\"\",LOOKUP('import danych'!F146,#REF!,#REF!))","v":""}]
[null,null,{"$f":"IF('import danych'!$I147=\"LINDE 01\",MAX(C$1:C141)+1,\"\")","v":""},{"$f":"IF('import danych'!$I147=\"LINDE 02\",MAX(D$1:D141)+1,\"\")","v":""},{"$f":"IF('import danych'!$I147=\"LINDE 03\",MAX(E$1:E141)+1,\"\")","v":""},{"$f":"IF('import danych'!$I147=\"YALE 04\",MAX(F$1:F141)+1,\"\")","v":""},{"$f":"IF('import danych'!$I147=\"SUR\",MAX(G$1:G141)+1,\"\")","v":""},{"$f":"IF('import danych'!$I147=\"SMP\",MAX(H$1:H141)+1,\"\")","v":""},{"$f":"IF('import danych'!D147=\"\",\"\",LOOKUP('import danych'!F147,#REF!,#REF!))","v":""}]
[null,null,{"$f":"IF('import danych'!$I148=\"LINDE 01\",MAX(C$1:C142)+1,\"\")","v":""},{"$f":"IF('import danych'!$I148=\"LINDE 02\",MAX(D$1:D142)+1,\"\")","v":""},{"$f":"IF('import danych'!$I148=\"LINDE 03\",MAX(E$1:E142)+1,\"\")","v":""},{"$f":"IF('import danych'!$I148=\"YALE 04\",MAX(F$1:F142)+1,\"\")","v":""},{"$f":"IF('import danych'!$I148=\"SUR\",MAX(G$1:G142)+1,\"\")","v":""},{"$f":"IF('import danych'!$I148=\"SMP\",MAX(H$1:H142)+1,\"\")","v":""},{"$f":"IF('import danych'!D148=\"\",\"\",LOOKUP('import danych'!F148,#REF!,#REF!))","v":""}]
[null,null,{"$f":"IF('import danych'!$I149=\"LINDE 01\",MAX(C$1:C143)+1,\"\")","v":""},{"$f":"IF('import danych'!$I149=\"LINDE 02\",MAX(D$1:D143)+1,\"\")","v":""},{"$f":"IF('import danych'!$I149=\"LINDE 03\",MAX(E$1:E143)+1,\"\")","v":""},{"$f":"IF('import danych'!$I149=\"YALE 04\",MAX(F$1:F143)+1,\"\")","v":""},{"$f":"IF('import danych'!$I149=\"SUR\",MAX(G$1:G143)+1,\"\")","v":""},{"$f":"IF('import danych'!$I149=\"SMP\",MAX(H$1:H143)+1,\"\")","v":""},{"$f":"IF('import danych'!D149=\"\",\"\",LOOKUP('import danych'!F149,#REF!,#REF!))","v":""}]
[null,null,{"$f":"IF('import danych'!$I150=\"LINDE 01\",MAX(C$1:C144)+1,\"\")","v":""},{"$f":"IF('import danych'!$I150=\"LINDE 02\",MAX(D$1:D144)+1,\"\")","v":""},{"$f":"IF('import danych'!$I150=\"LINDE 03\",MAX(E$1:E144)+1,\"\")","v":""},{"$f":"IF('import danych'!$I150=\"YALE 04\",MAX(F$1:F144)+1,\"\")","v":""},{"$f":"IF('import danych'!$I150=\"SUR\",MAX(G$1:G144)+1,\"\")","v":""},{"$f":"IF('import danych'!$I150=\"SMP\",MAX(H$1:H144)+1,\"\")","v":""},{"$f":"IF('import danych'!D150=\"\",\"\",LOOKUP('import danych'!F150,#REF!,#REF!))","v":""}]
[null,null,{"$f":"IF('import danych'!$I151=\"LINDE 01\",MAX(C$1:C145)+1,\"\")","v":""},{"$f":"IF('import danych'!$I151=\"LINDE 02\",MAX(D$1:D145)+1,\"\")","v":""},{"$f":"IF('import danych'!$I151=\"LINDE 03\",MAX(E$1:E145)+1,\"\")","v":""},{"$f":"IF('import danych'!$I151=\"YALE 04\",MAX(F$1:F145)+1,\"\")","v":""},{"$f":"IF('import danych'!$I151=\"SUR\",MAX(G$1:G145)+1,\"\")","v":""},{"$f":"IF('import danych'!$I151=\"SMP\",MAX(H$1:H145)+1,\"\")","v":""},{"$f":"IF('import danych'!D151=\"\",\"\",LOOKUP('import danych'!F151,#REF!,#REF!))","v":""}]
[null,null,{"$f":"IF('import danych'!$I152=\"LINDE 01\",MAX(C$1:C146)+1,\"\")","v":""},{"$f":"IF('import danych'!$I152=\"LINDE 02\",MAX(D$1:D146)+1,\"\")","v":""},{"$f":"IF('import danych'!$I152=\"LINDE 03\",MAX(E$1:E146)+1,\"\")","v":""},{"$f":"IF('import danych'!$I152=\"YALE 04\",MAX(F$1:F146)+1,\"\")","v":""},{"$f":"IF('import danych'!$I152=\"SUR\",MAX(G$1:G146)+1,\"\")","v":""},{"$f":"IF('import danych'!$I152=\"SMP\",MAX(H$1:H146)+1,\"\")","v":""},{"$f":"IF('import danych'!D152=\"\",\"\",LOOKUP('import danych'!F152,#REF!,#REF!))","v":""}]
[null,null,{"$f":"IF('import danych'!$I153=\"LINDE 01\",MAX(C$1:C147)+1,\"\")","v":""},{"$f":"IF('import danych'!$I153=\"LINDE 02\",MAX(D$1:D147)+1,\"\")","v":""},{"$f":"IF('import danych'!$I153=\"LINDE 03\",MAX(E$1:E147)+1,\"\")","v":""},{"$f":"IF('import danych'!$I153=\"YALE 04\",MAX(F$1:F147)+1,\"\")","v":""},{"$f":"IF('import danych'!$I153=\"SUR\",MAX(G$1:G147)+1,\"\")","v":""},{"$f":"IF('import danych'!$I153=\"SMP\",MAX(H$1:H147)+1,\"\")","v":""},{"$f":"IF('import danych'!D153=\"\",\"\",LOOKUP('import danych'!F153,#REF!,#REF!))","v":""}]
[null,null,{"$f":"IF('import danych'!$I154=\"LINDE 01\",MAX(C$1:C148)+1,\"\")","v":""},{"$f":"IF('import danych'!$I154=\"LINDE 02\",MAX(D$1:D148)+1,\"\")","v":""},{"$f":"IF('import danych'!$I154=\"LINDE 03\",MAX(E$1:E148)+1,\"\")","v":""},{"$f":"IF('import danych'!$I154=\"YALE 04\",MAX(F$1:F148)+1,\"\")","v":""},{"$f":"IF('import danych'!$I154=\"SUR\",MAX(G$1:G148)+1,\"\")","v":""},{"$f":"IF('import danych'!$I154=\"SMP\",MAX(H$1:H148)+1,\"\")","v":""},{"$f":"IF('import danych'!D154=\"\",\"\",LOOKUP('import danych'!F154,#REF!,#REF!))","v":""}]
[null,null,{"$f":"IF('import danych'!$I155=\"LINDE 01\",MAX(C$1:C149)+1,\"\")","v":""},{"$f":"IF('import danych'!$I155=\"LINDE 02\",MAX(D$1:D149)+1,\"\")","v":""},{"$f":"IF('import danych'!$I155=\"LINDE 03\",MAX(E$1:E149)+1,\"\")","v":""},{"$f":"IF('import danych'!$I155=\"YALE 04\",MAX(F$1:F149)+1,\"\")","v":""},{"$f":"IF('import danych'!$I155=\"SUR\",MAX(G$1:G149)+1,\"\")","v":""},{"$f":"IF('import danych'!$I155=\"SMP\",MAX(H$1:H149)+1,\"\")","v":""},{"$f":"IF('import danych'!D155=\"\",\"\",LOOKUP('import danych'!F155,#REF!,#REF!))","v":""}]
[null,null,{"$f":"IF('import danych'!$I156=\"LINDE 01\",MAX(C$1:C150)+1,\"\")","v":""},{"$f":"IF('import danych'!$I156=\"LINDE 02\",MAX(D$1:D150)+1,\"\")","v":""},{"$f":"IF('import danych'!$I156=\"LINDE 03\",MAX(E$1:E150)+1,\"\")","v":""},{"$f":"IF('import danych'!$I156=\"YALE 04\",MAX(F$1:F150)+1,\"\")","v":""},{"$f":"IF('import danych'!$I156=\"SUR\",MAX(G$1:G150)+1,\"\")","v":""},{"$f":"IF('import danych'!$I156=\"SMP\",MAX(H$1:H150)+1,\"\")","v":""},{"$f":"IF('import danych'!D156=\"\",\"\",LOOKUP('import danych'!F156,#REF!,#REF!))","v":""}]
[null,null,{"$f":"IF('import danych'!$I157=\"LINDE 01\",MAX(C$1:C151)+1,\"\")","v":""},{"$f":"IF('import danych'!$I157=\"LINDE 02\",MAX(D$1:D151)+1,\"\")","v":""},{"$f":"IF('import danych'!$I157=\"LINDE 03\",MAX(E$1:E151)+1,\"\")","v":""},{"$f":"IF('import danych'!$I157=\"YALE 04\",MAX(F$1:F151)+1,\"\")","v":""},{"$f":"IF('import danych'!$I157=\"SUR\",MAX(G$1:G151)+1,\"\")","v":""},{"$f":"IF('import danych'!$I157=\"SMP\",MAX(H$1:H151)+1,\"\")","v":""},{"$f":"IF('import danych'!D157=\"\",\"\",LOOKUP('import danych'!F157,#REF!,#REF!))","v":""}]
[null,null,{"$f":"IF('import danych'!$I158=\"LINDE 01\",MAX(C$1:C152)+1,\"\")","v":""},{"$f":"IF('import danych'!$I158=\"LINDE 02\",MAX(D$1:D152)+1,\"\")","v":""},{"$f":"IF('import danych'!$I158=\"LINDE 03\",MAX(E$1:E152)+1,\"\")","v":""},{"$f":"IF('import danych'!$I158=\"YALE 04\",MAX(F$1:F152)+1,\"\")","v":""},{"$f":"IF('import danych'!$I158=\"SUR\",MAX(G$1:G152)+1,\"\")","v":""},{"$f":"IF('import danych'!$I158=\"SMP\",MAX(H$1:H152)+1,\"\")","v":""},{"$f":"IF('import danych'!D158=\"\",\"\",LOOKUP('import danych'!F158,#REF!,#REF!))","v":""}]
[null,null,{"$f":"IF('import danych'!$I159=\"LINDE 01\",MAX(C$1:C153)+1,\"\")","v":""},{"$f":"IF('import danych'!$I159=\"LINDE 02\",MAX(D$1:D153)+1,\"\")","v":""},{"$f":"IF('import danych'!$I159=\"LINDE 03\",MAX(E$1:E153)+1,\"\")","v":""},{"$f":"IF('import danych'!$I159=\"YALE 04\",MAX(F$1:F153)+1,\"\")","v":""},{"$f":"IF('import danych'!$I159=\"SUR\",MAX(G$1:G153)+1,\"\")","v":""},{"$f":"IF('import danych'!$I159=\"SMP\",MAX(H$1:H153)+1,\"\")","v":""},{"$f":"IF('import danych'!D159=\"\",\"\",LOOKUP('import danych'!F159,#REF!,#REF!))","v":""}]
[null,null,{"$f":"IF('import danych'!$I160=\"LINDE 01\",MAX(C$1:C154)+1,\"\")","v":""},{"$f":"IF('import danych'!$I160=\"LINDE 02\",MAX(D$1:D154)+1,\"\")","v":""},{"$f":"IF('import danych'!$I160=\"LINDE 03\",MAX(E$1:E154)+1,\"\")","v":""},{"$f":"IF('import danych'!$I160=\"YALE 04\",MAX(F$1:F154)+1,\"\")","v":""},{"$f":"IF('import danych'!$I160=\"SUR\",MAX(G$1:G154)+1,\"\")","v":""},{"$f":"IF('import danych'!$I160=\"SMP\",MAX(H$1:H154)+1,\"\")","v":""},{"$f":"IF('import danych'!D160=\"\",\"\",LOOKUP('import danych'!F160,#REF!,#REF!))","v":""}]
[null,null,{"$f":"IF('import danych'!$I161=\"LINDE 01\",MAX(C$1:C155)+1,\"\")","v":""},{"$f":"IF('import danych'!$I161=\"LINDE 02\",MAX(D$1:D155)+1,\"\")","v":""},{"$f":"IF('import danych'!$I161=\"LINDE 03\",MAX(E$1:E155)+1,\"\")","v":""},{"$f":"IF('import danych'!$I161=\"YALE 04\",MAX(F$1:F155)+1,\"\")","v":""},{"$f":"IF('import danych'!$I161=\"SUR\",MAX(G$1:G155)+1,\"\")","v":""},{"$f":"IF('import danych'!$I161=\"SMP\",MAX(H$1:H155)+1,\"\")","v":""},{"$f":"IF('import danych'!D161=\"\",\"\",LOOKUP('import danych'!F161,#REF!,#REF!))","v":""}]
[null,null,{"$f":"IF('import danych'!$I162=\"LINDE 01\",MAX(C$1:C156)+1,\"\")","v":""},{"$f":"IF('import danych'!$I162=\"LINDE 02\",MAX(D$1:D156)+1,\"\")","v":""},{"$f":"IF('import danych'!$I162=\"LINDE 03\",MAX(E$1:E156)+1,\"\")","v":""},{"$f":"IF('import danych'!$I162=\"YALE 04\",MAX(F$1:F156)+1,\"\")","v":""},{"$f":"IF('import danych'!$I162=\"SUR\",MAX(G$1:G156)+1,\"\")","v":""},{"$f":"IF('import danych'!$I162=\"SMP\",MAX(H$1:H156)+1,\"\")","v":""},{"$f":"IF('import danych'!D162=\"\",\"\",LOOKUP('import danych'!F162,#REF!,#REF!))","v":""}]
[null,null,{"$f":"IF('import danych'!$I163=\"LINDE 01\",MAX(C$1:C157)+1,\"\")","v":""},{"$f":"IF('import danych'!$I163=\"LINDE 02\",MAX(D$1:D157)+1,\"\")","v":""},{"$f":"IF('import danych'!$I163=\"LINDE 03\",MAX(E$1:E157)+1,\"\")","v":""},{"$f":"IF('import danych'!$I163=\"YALE 04\",MAX(F$1:F157)+1,\"\")","v":""},{"$f":"IF('import danych'!$I163=\"SUR\",MAX(G$1:G157)+1,\"\")","v":""},{"$f":"IF('import danych'!$I163=\"SMP\",MAX(H$1:H157)+1,\"\")","v":""},{"$f":"IF('import danych'!D163=\"\",\"\",LOOKUP('import danych'!F163,#REF!,#REF!))","v":""}]
[null,null,{"$f":"IF('import danych'!$I164=\"LINDE 01\",MAX(C$1:C158)+1,\"\")","v":""},{"$f":"IF('import danych'!$I164=\"LINDE 02\",MAX(D$1:D158)+1,\"\")","v":""},{"$f":"IF('import danych'!$I164=\"LINDE 03\",MAX(E$1:E158)+1,\"\")","v":""},{"$f":"IF('import danych'!$I164=\"YALE 04\",MAX(F$1:F158)+1,\"\")","v":""},{"$f":"IF('import danych'!$I164=\"SUR\",MAX(G$1:G158)+1,\"\")","v":""},{"$f":"IF('import danych'!$I164=\"SMP\",MAX(H$1:H158)+1,\"\")","v":""},{"$f":"IF('import danych'!D164=\"\",\"\",LOOKUP('import danych'!F164,#REF!,#REF!))","v":""}]
[null,null,{"$f":"IF('import danych'!$I165=\"LINDE 01\",MAX(C$1:C159)+1,\"\")","v":""},{"$f":"IF('import danych'!$I165=\"LINDE 02\",MAX(D$1:D159)+1,\"\")","v":""},{"$f":"IF('import danych'!$I165=\"LINDE 03\",MAX(E$1:E159)+1,\"\")","v":""},{"$f":"IF('import danych'!$I165=\"YALE 04\",MAX(F$1:F159)+1,\"\")","v":""},{"$f":"IF('import danych'!$I165=\"SUR\",MAX(G$1:G159)+1,\"\")","v":""},{"$f":"IF('import danych'!$I165=\"SMP\",MAX(H$1:H159)+1,\"\")","v":""},{"$f":"IF('import danych'!D165=\"\",\"\",LOOKUP('import danych'!F165,#REF!,#REF!))","v":""}]
[null,null,{"$f":"IF('import danych'!$I166=\"LINDE 01\",MAX(C$1:C160)+1,\"\")","v":""},{"$f":"IF('import danych'!$I166=\"LINDE 02\",MAX(D$1:D160)+1,\"\")","v":""},{"$f":"IF('import danych'!$I166=\"LINDE 03\",MAX(E$1:E160)+1,\"\")","v":""},{"$f":"IF('import danych'!$I166=\"YALE 04\",MAX(F$1:F160)+1,\"\")","v":""},{"$f":"IF('import danych'!$I166=\"SUR\",MAX(G$1:G160)+1,\"\")","v":""},{"$f":"IF('import danych'!$I166=\"SMP\",MAX(H$1:H160)+1,\"\")","v":""},{"$f":"IF('import danych'!D166=\"\",\"\",LOOKUP('import danych'!F166,#REF!,#REF!))","v":""}]
[null,null,{"$f":"IF('import danych'!$I167=\"LINDE 01\",MAX(C$1:C161)+1,\"\")","v":""},{"$f":"IF('import danych'!$I167=\"LINDE 02\",MAX(D$1:D161)+1,\"\")","v":""},{"$f":"IF('import danych'!$I167=\"LINDE 03\",MAX(E$1:E161)+1,\"\")","v":""},{"$f":"IF('import danych'!$I167=\"YALE 04\",MAX(F$1:F161)+1,\"\")","v":""},{"$f":"IF('import danych'!$I167=\"SUR\",MAX(G$1:G161)+1,\"\")","v":""},{"$f":"IF('import danych'!$I167=\"SMP\",MAX(H$1:H161)+1,\"\")","v":""},{"$f":"IF('import danych'!D167=\"\",\"\",LOOKUP('import danych'!F167,#REF!,#REF!))","v":""}]
[null,null,{"$f":"IF('import danych'!$I168=\"LINDE 01\",MAX(C$1:C162)+1,\"\")","v":""},{"$f":"IF('import danych'!$I168=\"LINDE 02\",MAX(D$1:D162)+1,\"\")","v":""},{"$f":"IF('import danych'!$I168=\"LINDE 03\",MAX(E$1:E162)+1,\"\")","v":""},{"$f":"IF('import danych'!$I168=\"YALE 04\",MAX(F$1:F162)+1,\"\")","v":""},{"$f":"IF('import danych'!$I168=\"SUR\",MAX(G$1:G162)+1,\"\")","v":""},{"$f":"IF('import danych'!$I168=\"SMP\",MAX(H$1:H162)+1,\"\")","v":""},{"$f":"IF('import danych'!D168=\"\",\"\",LOOKUP('import danych'!F168,#REF!,#REF!))","v":""}]
[null,null,{"$f":"IF('import danych'!$I169=\"LINDE 01\",MAX(C$1:C163)+1,\"\")","v":""},{"$f":"IF('import danych'!$I169=\"LINDE 02\",MAX(D$1:D163)+1,\"\")","v":""},{"$f":"IF('import danych'!$I169=\"LINDE 03\",MAX(E$1:E163)+1,\"\")","v":""},{"$f":"IF('import danych'!$I169=\"YALE 04\",MAX(F$1:F163)+1,\"\")","v":""},{"$f":"IF('import danych'!$I169=\"SUR\",MAX(G$1:G163)+1,\"\")","v":""},{"$f":"IF('import danych'!$I169=\"SMP\",MAX(H$1:H163)+1,\"\")","v":""},{"$f":"IF('import danych'!D169=\"\",\"\",LOOKUP('import danych'!F169,#REF!,#REF!))","v":""}]
[null,null,{"$f":"IF('import danych'!$I170=\"LINDE 01\",MAX(C$1:C164)+1,\"\")","v":""},{"$f":"IF('import danych'!$I170=\"LINDE 02\",MAX(D$1:D164)+1,\"\")","v":""},{"$f":"IF('import danych'!$I170=\"LINDE 03\",MAX(E$1:E164)+1,\"\")","v":""},{"$f":"IF('import danych'!$I170=\"YALE 04\",MAX(F$1:F164)+1,\"\")","v":""},{"$f":"IF('import danych'!$I170=\"SUR\",MAX(G$1:G164)+1,\"\")","v":""},{"$f":"IF('import danych'!$I170=\"SMP\",MAX(H$1:H164)+1,\"\")","v":""},{"$f":"IF('import danych'!D170=\"\",\"\",LOOKUP('import danych'!F170,#REF!,#REF!))","v":""}]
[null,null,{"$f":"IF('import danych'!$I171=\"LINDE 01\",MAX(C$1:C165)+1,\"\")","v":""},{"$f":"IF('import danych'!$I171=\"LINDE 02\",MAX(D$1:D165)+1,\"\")","v":""},{"$f":"IF('import danych'!$I171=\"LINDE 03\",MAX(E$1:E165)+1,\"\")","v":""},{"$f":"IF('import danych'!$I171=\"YALE 04\",MAX(F$1:F165)+1,\"\")","v":""},{"$f":"IF('import danych'!$I171=\"SUR\",MAX(G$1:G165)+1,\"\")","v":""},{"$f":"IF('import danych'!$I171=\"SMP\",MAX(H$1:H165)+1,\"\")","v":""},{"$f":"IF('import danych'!D171=\"\",\"\",LOOKUP('import danych'!F171,#REF!,#REF!))","v":""}]
[null,null,{"$f":"IF('import danych'!$I172=\"LINDE 01\",MAX(C$1:C166)+1,\"\")","v":""},{"$f":"IF('import danych'!$I172=\"LINDE 02\",MAX(D$1:D166)+1,\"\")","v":""},{"$f":"IF('import danych'!$I172=\"LINDE 03\",MAX(E$1:E166)+1,\"\")","v":""},{"$f":"IF('import danych'!$I172=\"YALE 04\",MAX(F$1:F166)+1,\"\")","v":""},{"$f":"IF('import danych'!$I172=\"SUR\",MAX(G$1:G166)+1,\"\")","v":""},{"$f":"IF('import danych'!$I172=\"SMP\",MAX(H$1:H166)+1,\"\")","v":""},{"$f":"IF('import danych'!D172=\"\",\"\",LOOKUP('import danych'!F172,#REF!,#REF!))","v":""}]
[null,null,{"$f":"IF('import danych'!$I173=\"LINDE 01\",MAX(C$1:C167)+1,\"\")","v":""},{"$f":"IF('import danych'!$I173=\"LINDE 02\",MAX(D$1:D167)+1,\"\")","v":""},{"$f":"IF('import danych'!$I173=\"LINDE 03\",MAX(E$1:E167)+1,\"\")","v":""},{"$f":"IF('import danych'!$I173=\"YALE 04\",MAX(F$1:F167)+1,\"\")","v":""},{"$f":"IF('import danych'!$I173=\"SUR\",MAX(G$1:G167)+1,\"\")","v":""},{"$f":"IF('import danych'!$I173=\"SMP\",MAX(H$1:H167)+1,\"\")","v":""},{"$f":"IF('import danych'!D173=\"\",\"\",LOOKUP('import danych'!F173,#REF!,#REF!))","v":""}]
[null,null,{"$f":"IF('import danych'!$I174=\"LINDE 01\",MAX(C$1:C168)+1,\"\")","v":""},{"$f":"IF('import danych'!$I174=\"LINDE 02\",MAX(D$1:D168)+1,\"\")","v":""},{"$f":"IF('import danych'!$I174=\"LINDE 03\",MAX(E$1:E168)+1,\"\")","v":""},{"$f":"IF('import danych'!$I174=\"YALE 04\",MAX(F$1:F168)+1,\"\")","v":""},{"$f":"IF('import danych'!$I174=\"SUR\",MAX(G$1:G168)+1,\"\")","v":""},{"$f":"IF('import danych'!$I174=\"SMP\",MAX(H$1:H168)+1,\"\")","v":""},{"$f":"IF('import danych'!D174=\"\",\"\",LOOKUP('import danych'!F174,#REF!,#REF!))","v":""}]
[null,null,{"$f":"IF('import danych'!$I175=\"LINDE 01\",MAX(C$1:C169)+1,\"\")","v":""},{"$f":"IF('import danych'!$I175=\"LINDE 02\",MAX(D$1:D169)+1,\"\")","v":""},{"$f":"IF('import danych'!$I175=\"LINDE 03\",MAX(E$1:E169)+1,\"\")","v":""},{"$f":"IF('import danych'!$I175=\"YALE 04\",MAX(F$1:F169)+1,\"\")","v":""},{"$f":"IF('import danych'!$I175=\"SUR\",MAX(G$1:G169)+1,\"\")","v":""},{"$f":"IF('import danych'!$I175=\"SMP\",MAX(H$1:H169)+1,\"\")","v":""},{"$f":"IF('import danych'!D175=\"\",\"\",LOOKUP('import danych'!F175,#REF!,#REF!))","v":""}]
[null,null,{"$f":"IF('import danych'!$I176=\"LINDE 01\",MAX(C$1:C170)+1,\"\")","v":""},{"$f":"IF('import danych'!$I176=\"LINDE 02\",MAX(D$1:D170)+1,\"\")","v":""},{"$f":"IF('import danych'!$I176=\"LINDE 03\",MAX(E$1:E170)+1,\"\")","v":""},{"$f":"IF('import danych'!$I176=\"YALE 04\",MAX(F$1:F170)+1,\"\")","v":""},{"$f":"IF('import danych'!$I176=\"SUR\",MAX(G$1:G170)+1,\"\")","v":""},{"$f":"IF('import danych'!$I176=\"SMP\",MAX(H$1:H170)+1,\"\")","v":""},{"$f":"IF('import danych'!D176=\"\",\"\",LOOKUP('import danych'!F176,#REF!,#REF!))","v":""}]
[null,null,{"$f":"IF('import danych'!$I177=\"LINDE 01\",MAX(C$1:C171)+1,\"\")","v":""},{"$f":"IF('import danych'!$I177=\"LINDE 02\",MAX(D$1:D171)+1,\"\")","v":""},{"$f":"IF('import danych'!$I177=\"LINDE 03\",MAX(E$1:E171)+1,\"\")","v":""},{"$f":"IF('import danych'!$I177=\"YALE 04\",MAX(F$1:F171)+1,\"\")","v":""},{"$f":"IF('import danych'!$I177=\"SUR\",MAX(G$1:G171)+1,\"\")","v":""},{"$f":"IF('import danych'!$I177=\"SMP\",MAX(H$1:H171)+1,\"\")","v":""},{"$f":"IF('import danych'!D177=\"\",\"\",LOOKUP('import danych'!F177,#REF!,#REF!))","v":""}]
[null,null,{"$f":"IF('import danych'!$I178=\"LINDE 01\",MAX(C$1:C172)+1,\"\")","v":""},{"$f":"IF('import danych'!$I178=\"LINDE 02\",MAX(D$1:D172)+1,\"\")","v":""},{"$f":"IF('import danych'!$I178=\"LINDE 03\",MAX(E$1:E172)+1,\"\")","v":""},{"$f":"IF('import danych'!$I178=\"YALE 04\",MAX(F$1:F172)+1,\"\")","v":""},{"$f":"IF('import danych'!$I178=\"SUR\",MAX(G$1:G172)+1,\"\")","v":""},{"$f":"IF('import danych'!$I178=\"SMP\",MAX(H$1:H172)+1,\"\")","v":""},{"$f":"IF('import danych'!D178=\"\",\"\",LOOKUP('import danych'!F178,#REF!,#REF!))","v":""}]
[null,null,{"$f":"IF('import danych'!$I179=\"LINDE 01\",MAX(C$1:C173)+1,\"\")","v":""},{"$f":"IF('import danych'!$I179=\"LINDE 02\",MAX(D$1:D173)+1,\"\")","v":""},{"$f":"IF('import danych'!$I179=\"LINDE 03\",MAX(E$1:E173)+1,\"\")","v":""},{"$f":"IF('import danych'!$I179=\"YALE 04\",MAX(F$1:F173)+1,\"\")","v":""},{"$f":"IF('import danych'!$I179=\"SUR\",MAX(G$1:G173)+1,\"\")","v":""},{"$f":"IF('import danych'!$I179=\"SMP\",MAX(H$1:H173)+1,\"\")","v":""},{"$f":"IF('import danych'!D179=\"\",\"\",LOOKUP('import danych'!F179,#REF!,#REF!))","v":""}]
[null,null,{"$f":"IF('import danych'!$I180=\"LINDE 01\",MAX(C$1:C174)+1,\"\")","v":""},{"$f":"IF('import danych'!$I180=\"LINDE 02\",MAX(D$1:D174)+1,\"\")","v":""},{"$f":"IF('import danych'!$I180=\"LINDE 03\",MAX(E$1:E174)+1,\"\")","v":""},{"$f":"IF('import danych'!$I180=\"YALE 04\",MAX(F$1:F174)+1,\"\")","v":""},{"$f":"IF('import danych'!$I180=\"SUR\",MAX(G$1:G174)+1,\"\")","v":""},{"$f":"IF('import danych'!$I180=\"SMP\",MAX(H$1:H174)+1,\"\")","v":""},{"$f":"IF('import danych'!D180=\"\",\"\",LOOKUP('import danych'!F180,#REF!,#REF!))","v":""}]
[null,null,{"$f":"IF('import danych'!$I181=\"LINDE 01\",MAX(C$1:C175)+1,\"\")","v":""},{"$f":"IF('import danych'!$I181=\"LINDE 02\",MAX(D$1:D175)+1,\"\")","v":""},{"$f":"IF('import danych'!$I181=\"LINDE 03\",MAX(E$1:E175)+1,\"\")","v":""},{"$f":"IF('import danych'!$I181=\"YALE 04\",MAX(F$1:F175)+1,\"\")","v":""},{"$f":"IF('import danych'!$I181=\"SUR\",MAX(G$1:G175)+1,\"\")","v":""},{"$f":"IF('import danych'!$I181=\"SMP\",MAX(H$1:H175)+1,\"\")","v":""},{"$f":"IF('import danych'!D181=\"\",\"\",LOOKUP('import danych'!F181,#REF!,#REF!))","v":""}]
[null,null,{"$f":"IF('import danych'!$I182=\"LINDE 01\",MAX(C$1:C176)+1,\"\")","v":""},{"$f":"IF('import danych'!$I182=\"LINDE 02\",MAX(D$1:D176)+1,\"\")","v":""},{"$f":"IF('import danych'!$I182=\"LINDE 03\",MAX(E$1:E176)+1,\"\")","v":""},{"$f":"IF('import danych'!$I182=\"YALE 04\",MAX(F$1:F176)+1,\"\")","v":""},{"$f":"IF('import danych'!$I182=\"SUR\",MAX(G$1:G176)+1,\"\")","v":""},{"$f":"IF('import danych'!$I182=\"SMP\",MAX(H$1:H176)+1,\"\")","v":""},{"$f":"IF('import danych'!D182=\"\",\"\",LOOKUP('import danych'!F182,#REF!,#REF!))","v":""}]
[null,null,{"$f":"IF('import danych'!$I183=\"LINDE 01\",MAX(C$1:C177)+1,\"\")","v":""},{"$f":"IF('import danych'!$I183=\"LINDE 02\",MAX(D$1:D177)+1,\"\")","v":""},{"$f":"IF('import danych'!$I183=\"LINDE 03\",MAX(E$1:E177)+1,\"\")","v":""},{"$f":"IF('import danych'!$I183=\"YALE 04\",MAX(F$1:F177)+1,\"\")","v":""},{"$f":"IF('import danych'!$I183=\"SUR\",MAX(G$1:G177)+1,\"\")","v":""},{"$f":"IF('import danych'!$I183=\"SMP\",MAX(H$1:H177)+1,\"\")","v":""},{"$f":"IF('import danych'!D183=\"\",\"\",LOOKUP('import danych'!F183,#REF!,#REF!))","v":""}]
[null,null,{"$f":"IF('import danych'!$I184=\"LINDE 01\",MAX(C$1:C178)+1,\"\")","v":""},{"$f":"IF('import danych'!$I184=\"LINDE 02\",MAX(D$1:D178)+1,\"\")","v":""},{"$f":"IF('import danych'!$I184=\"LINDE 03\",MAX(E$1:E178)+1,\"\")","v":""},{"$f":"IF('import danych'!$I184=\"YALE 04\",MAX(F$1:F178)+1,\"\")","v":""},{"$f":"IF('import danych'!$I184=\"SUR\",MAX(G$1:G178)+1,\"\")","v":""},{"$f":"IF('import danych'!$I184=\"SMP\",MAX(H$1:H178)+1,\"\")","v":""},{"$f":"IF('import danych'!D184=\"\",\"\",LOOKUP('import danych'!F184,#REF!,#REF!))","v":""}]
[null,null,{"$f":"IF('import danych'!$I185=\"LINDE 01\",MAX(C$1:C179)+1,\"\")","v":""},{"$f":"IF('import danych'!$I185=\"LINDE 02\",MAX(D$1:D179)+1,\"\")","v":""},{"$f":"IF('import danych'!$I185=\"LINDE 03\",MAX(E$1:E179)+1,\"\")","v":""},{"$f":"IF('import danych'!$I185=\"YALE 04\",MAX(F$1:F179)+1,\"\")","v":""},{"$f":"IF('import danych'!$I185=\"SUR\",MAX(G$1:G179)+1,\"\")","v":""},{"$f":"IF('import danych'!$I185=\"SMP\",MAX(H$1:H179)+1,\"\")","v":""},{"$f":"IF('import danych'!D185=\"\",\"\",LOOKUP('import danych'!F185,#REF!,#REF!))","v":""}]
[null,null,{"$f":"IF('import danych'!$I186=\"LINDE 01\",MAX(C$1:C180)+1,\"\")","v":""},{"$f":"IF('import danych'!$I186=\"LINDE 02\",MAX(D$1:D180)+1,\"\")","v":""},{"$f":"IF('import danych'!$I186=\"LINDE 03\",MAX(E$1:E180)+1,\"\")","v":""},{"$f":"IF('import danych'!$I186=\"YALE 04\",MAX(F$1:F180)+1,\"\")","v":""},{"$f":"IF('import danych'!$I186=\"SUR\",MAX(G$1:G180)+1,\"\")","v":""},{"$f":"IF('import danych'!$I186=\"SMP\",MAX(H$1:H180)+1,\"\")","v":""},{"$f":"IF('import danych'!D186=\"\",\"\",LOOKUP('import danych'!F186,#REF!,#REF!))","v":""}]
[null,null,{"$f":"IF('import danych'!$I187=\"LINDE 01\",MAX(C$1:C181)+1,\"\")","v":""},{"$f":"IF('import danych'!$I187=\"LINDE 02\",MAX(D$1:D181)+1,\"\")","v":""},{"$f":"IF('import danych'!$I187=\"LINDE 03\",MAX(E$1:E181)+1,\"\")","v":""},{"$f":"IF('import danych'!$I187=\"YALE 04\",MAX(F$1:F181)+1,\"\")","v":""},{"$f":"IF('import danych'!$I187=\"SUR\",MAX(G$1:G181)+1,\"\")","v":""},{"$f":"IF('import danych'!$I187=\"SMP\",MAX(H$1:H181)+1,\"\")","v":""},{"$f":"IF('import danych'!D187=\"\",\"\",LOOKUP('import danych'!F187,#REF!,#REF!))","v":""}]
[null,null,{"$f":"IF('import danych'!$I188=\"LINDE 01\",MAX(C$1:C182)+1,\"\")","v":""},{"$f":"IF('import danych'!$I188=\"LINDE 02\",MAX(D$1:D182)+1,\"\")","v":""},{"$f":"IF('import danych'!$I188=\"LINDE 03\",MAX(E$1:E182)+1,\"\")","v":""},{"$f":"IF('import danych'!$I188=\"YALE 04\",MAX(F$1:F182)+1,\"\")","v":""},{"$f":"IF('import danych'!$I188=\"SUR\",MAX(G$1:G182)+1,\"\")","v":""},{"$f":"IF('import danych'!$I188=\"SMP\",MAX(H$1:H182)+1,\"\")","v":""},{"$f":"IF('import danych'!D188=\"\",\"\",LOOKUP('import danych'!F188,#REF!,#REF!))","v":""}]
[null,null,{"$f":"IF('import danych'!$I189=\"LINDE 01\",MAX(C$1:C183)+1,\"\")","v":""},{"$f":"IF('import danych'!$I189=\"LINDE 02\",MAX(D$1:D183)+1,\"\")","v":""},{"$f":"IF('import danych'!$I189=\"LINDE 03\",MAX(E$1:E183)+1,\"\")","v":""},{"$f":"IF('import danych'!$I189=\"YALE 04\",MAX(F$1:F183)+1,\"\")","v":""},{"$f":"IF('import danych'!$I189=\"SUR\",MAX(G$1:G183)+1,\"\")","v":""},{"$f":"IF('import danych'!$I189=\"SMP\",MAX(H$1:H183)+1,\"\")","v":""},{"$f":"IF('import danych'!D189=\"\",\"\",LOOKUP('import danych'!F189,#REF!,#REF!))","v":""}]
[null,null,{"$f":"IF('import danych'!$I190=\"LINDE 01\",MAX(C$1:C184)+1,\"\")","v":""},{"$f":"IF('import danych'!$I190=\"LINDE 02\",MAX(D$1:D184)+1,\"\")","v":""},{"$f":"IF('import danych'!$I190=\"LINDE 03\",MAX(E$1:E184)+1,\"\")","v":""},{"$f":"IF('import danych'!$I190=\"YALE 04\",MAX(F$1:F184)+1,\"\")","v":""},{"$f":"IF('import danych'!$I190=\"SUR\",MAX(G$1:G184)+1,\"\")","v":""},{"$f":"IF('import danych'!$I190=\"SMP\",MAX(H$1:H184)+1,\"\")","v":""},{"$f":"IF('import danych'!D190=\"\",\"\",LOOKUP('import danych'!F190,#REF!,#REF!))","v":""}]
[null,null,{"$f":"IF('import danych'!$I191=\"LINDE 01\",MAX(C$1:C185)+1,\"\")","v":""},{"$f":"IF('import danych'!$I191=\"LINDE 02\",MAX(D$1:D185)+1,\"\")","v":""},{"$f":"IF('import danych'!$I191=\"LINDE 03\",MAX(E$1:E185)+1,\"\")","v":""},{"$f":"IF('import danych'!$I191=\"YALE 04\",MAX(F$1:F185)+1,\"\")","v":""},{"$f":"IF('import danych'!$I191=\"SUR\",MAX(G$1:G185)+1,\"\")","v":""},{"$f":"IF('import danych'!$I191=\"SMP\",MAX(H$1:H185)+1,\"\")","v":""},{"$f":"IF('import danych'!D191=\"\",\"\",LOOKUP('import danych'!F191,#REF!,#REF!))","v":""}]
[null,null,{"$f":"IF('import danych'!$I192=\"LINDE 01\",MAX(C$1:C186)+1,\"\")","v":""},{"$f":"IF('import danych'!$I192=\"LINDE 02\",MAX(D$1:D186)+1,\"\")","v":""},{"$f":"IF('import danych'!$I192=\"LINDE 03\",MAX(E$1:E186)+1,\"\")","v":""},{"$f":"IF('import danych'!$I192=\"YALE 04\",MAX(F$1:F186)+1,\"\")","v":""},{"$f":"IF('import danych'!$I192=\"SUR\",MAX(G$1:G186)+1,\"\")","v":""},{"$f":"IF('import danych'!$I192=\"SMP\",MAX(H$1:H186)+1,\"\")","v":""},{"$f":"IF('import danych'!D192=\"\",\"\",LOOKUP('import danych'!F192,#REF!,#REF!))","v":""}]
[null,null,{"$f":"IF('import danych'!$I193=\"LINDE 01\",MAX(C$1:C187)+1,\"\")","v":""},{"$f":"IF('import danych'!$I193=\"LINDE 02\",MAX(D$1:D187)+1,\"\")","v":""},{"$f":"IF('import danych'!$I193=\"LINDE 03\",MAX(E$1:E187)+1,\"\")","v":""},{"$f":"IF('import danych'!$I193=\"YALE 04\",MAX(F$1:F187)+1,\"\")","v":""},{"$f":"IF('import danych'!$I194=\"SUR\",MAX(G$1:G187)+1,\"\")","v":""},{"$f":"IF('import danych'!$I193=\"SMP\",MAX(H$1:H187)+1,\"\")","v":""},{"$f":"IF('import danych'!D193=\"\",\"\",LOOKUP('import danych'!F193,#REF!,#REF!))","v":""}]
[null,null,{"$f":"IF('import danych'!$I194=\"LINDE 01\",MAX(C$1:C188)+1,\"\")","v":""},{"$f":"IF('import danych'!$I194=\"LINDE 02\",MAX(D$1:D188)+1,\"\")","v":""},{"$f":"IF('import danych'!$I194=\"LINDE 03\",MAX(E$1:E188)+1,\"\")","v":""},{"$f":"IF('import danych'!$I194=\"YALE 04\",MAX(F$1:F188)+1,\"\")","v":""},{"$f":"IF('import danych'!$I195=\"SUR\",MAX(G$1:G188)+1,\"\")","v":""},{"$f":"IF('import danych'!$I194=\"SMP\",MAX(H$1:H188)+1,\"\")","v":""},{"$f":"IF('import danych'!D194=\"\",\"\",LOOKUP('import danych'!F194,#REF!,#REF!))","v":""}]
[null,null,{"$f":"IF('import danych'!$I195=\"LINDE 01\",MAX(C$1:C189)+1,\"\")","v":""},{"$f":"IF('import danych'!$I195=\"LINDE 02\",MAX(D$1:D189)+1,\"\")","v":""},{"$f":"IF('import danych'!$I195=\"LINDE 03\",MAX(E$1:E189)+1,\"\")","v":""},{"$f":"IF('import danych'!$I195=\"YALE 04\",MAX(F$1:F189)+1,\"\")","v":""},{"$f":"IF('import danych'!$I196=\"SUR\",MAX(G$1:G189)+1,\"\")","v":""},{"$f":"IF('import danych'!$I195=\"SMP\",MAX(H$1:H189)+1,\"\")","v":""},{"$f":"IF('import danych'!D195=\"\",\"\",LOOKUP('import danych'!F195,#REF!,#REF!))","v":""}]
[{"$nulls":8},{"$f":"IF('import danych'!D196=\"\",\"\",LOOKUP('import danych'!F196,#REF!,#REF!))","v":""}]
[{"$nulls":8},{"$f":"IF('import danych'!D197=\"\",\"\",LOOKUP('import danych'!F197,#REF!,#REF!))","v":""}]
[{"$nulls":8},{"$f":"IF('import danych'!D198=\"\",\"\",LOOKUP('import danych'!F198,#REF!,#REF!))","v":""}]
[{"$nulls":8},{"$f":"IF('import danych'!D199=\"\",\"\",LOOKUP('import danych'!F199,#REF!,#REF!))","v":""}]
[{"$nulls":8},{"$f":"IF('import danych'!D200=\"\",\"\",LOOKUP('import danych'!F200,#REF!,#REF!))","v":""}]
[{"$nulls":8},{"$f":"IF('import danych'!D201=\"\",\"\",LOOKUP('import danych'!F201,#REF!,#REF!))","v":""}]
[{"$nulls":8},{"$f":"IF('import danych'!D202=\"\",\"\",LOOKUP('import danych'!F202,#REF!,#REF!))","v":""}]
[{"$nulls":8},{"$f":"IF('import danych'!D203=\"\",\"\",LOOKUP('import danych'!F203,#REF!,#REF!))","v":""}]
[{"$nulls":8},{"$f":"IF('import danych'!D204=\"\",\"\",LOOKUP('import danych'!F204,#REF!,#REF!))","v":""}]
[{"$nulls":8},{"$f":"IF('import danych'!D205=\"\",\"\",LOOKUP('import danych'!F205,#REF!,#REF!))","v":""}]

{"sheet":"Stan Zbiornika","index":3,"n_rows":24,"n_cols":12,"rows_kept":24,"merged":[[5,5,5,8],[6,5,6,6],[7,5,8,5],[7,8,8,8],[10,5,10,6],[11,5,11,6],[12,5,12,6],[13,5,13,6]]}
["Lp.","Data","wartość"]
[{"$f":"IF(B2=\"\",\"\",ROW()-1)","v":1},"2012-09-17",4937]
[{"$f":"IF(B3=\"\",\"\",ROW()-1)","v":""},{"$nulls":6},"Data:","2012-10-31",null,null,"01"]
["",{"$nulls":6},"stan aktualny",{"$f":"SUM(C:C)-SUM('import danych'!L:L)","v":{"v":749.5600000000004,"d":"749.56 l"}},null,null,"Arkusz 2"]
["",{"$nulls":10},"Arkusz 3"]
["",{"$nulls":4},"Podział procentowy",{"$nulls":5},"Arkusz 4"]
["",{"$nulls":4},"Jednostka organizacyjna",null,"ilość","udział procentowy",null,null,"Arkusz 5"]
["",{"$nulls":5},1,{"$f":"SUMIFS('import danych'!L:L,'import danych'!I:I,\"LINDE 01\")","v":{"v":1494.0900000000001,"d":"1494.09 l"}},{"$f":"SUM($H$8,$H$9)*100/SUM(H8:H12)","v":{"v":77.49102062230114,"d":"77 %"}},null,null,"Arkusz 6"]
["",{"$nulls":5},2,{"$f":"SUMIFS('import danych'!L:L,'import danych'!I:I,\"LINDE 02\")","v":{"v":1578.15,"d":"1578.15 l"}},{"$nulls":3},"Aktualny"]
["",{"$nulls":5},3,{"$f":"SUMIFS('import danych'!L:L,'import danych'!I:I,\"LINDE 03\")","v":{"v":789.59,"d":"789.59 l"}},{"$f":"H10*100/SUM(H8:H12)","v":{"v":19.915805722587674,"d":"20 %"}},null,null,"data od"]
["",{"$nulls":4},4,null,{"$f":"SUMIFS('import danych'!L:L,'import danych'!I:I,\"YALE 04\")","v":{"v":0,"d":"0.00 l"}},{"$f":"H11*100/SUM(H8:H12)","v":{"v":0,"d":"0 %"}},null,null,"data do"]
["",{"$nulls":4},5,null,{"$f":"SUMIFS('import danych'!L:L,'import danych'!I:I,\"SUR\")","v":{"v":102.81,"d":"102.81 l"}},{"$f":"H12*100/SUM(H8:H12)","v":{"v":2.593173655111183,"d":"3 %"}}]
["",{"$nulls":4},6,null,{"$f":"SUMIFS('import danych'!L:L,'import danych'!I:I,\"SMP\")","v":{"v":222.8,"d":"222.80 l"}}]
["",{"$nulls":4},"SUMA",null,{"$f":"SUM(H8:H13)","v":{"v":4187.4400000000005,"d":"4187.44 l"}},{"$f":"SUM(I8:I12)","v":{"v":100,"d":"100 %"}}]
[""]
[""]
[""]
[""]
[""]
[""]
[""]
[""]
[""]
[""]