{"text_format":"3","workbook":"xlsx","n_sheets":4,"sheets":[" 01","import danych","Arkusz1","Stan Zbiornika"],"not_rendered":{"macros":1,"external_links":1,"defined_names":5},"read":"whole","date_system":"1900"}

{"sheet":" 01","index":0,"n_rows":200,"n_cols":19,"rows_kept":200,"merged":[[3,9,3,10],[8,16,8,17],[9,16,9,17],[10,16,10,17]]}
[{"$nulls":4},"LINDE 01",{"$nulls":5},{"$f":"VLOOKUP($N$4,$B:$H,7,FALSE)","v":2}]
["Lp.","DATA",null,"GODZINA","PRACOWNIK","Stan motogodzin","ilość zatankowanego paliwa",{"$nulls":3},{"$f":"LOOKUP(DATEVALUE($O$4),$C:$C,A:A)","v":38}]
[{"$f":"IF(ISERROR(MATCH(ROW()-2,Arkusz1!$C:$C,0)),\"\",INDEX(Arkusz1!C:C,MATCH(ROW()-2,Arkusz1!$C:$C,0)))","v":1},{"$f":"IF(ISERROR(MATCH(ROW()-2,Arkusz1!$C:$C,0)),\"\",INDEX('import danych'!$A:$A,MATCH(ROW()-2,Arkusz1!$C:$C,0)+5))","v":""},{"$f":"IF(A3=\"\",\"\",DATEVALUE(B3))","v":{"$error":"#VALUE!"}},{"$f":"IF(ISERROR(MATCH(ROW()-2,Arkusz1!$C:$C,0)),\"\",INDEX('import danych'!$B:$B,MATCH(ROW()-2,Arkusz1!$C:$C,0)+5))","v":""},{"$f":"IF(ISERROR(MATCH(ROW()-2,Arkusz1!$C:$C,0)),\"\",INDEX(Arkusz1!I:I,MATCH(ROW()-2,Arkusz1!$C:$C,0)))","v":"PRACOWNIK"},{"$f":"IF(ISERROR(MATCH(ROW()-2,Arkusz1!$C:$C,0)),\"\",INDEX('import danych'!$H:$H,MATCH(ROW()-2,Arkusz1!$C:$C,0)+5))","v":""},{"$f":"IF(ISERROR(MATCH(ROW()-2,Arkusz1!$C:$C,0)),\"\",INDEX('import danych'!$L:$L,MATCH(ROW()-2,Arkusz1!$C:$C,0)+5))","v":""},{"$f":"A3","v":1},{"$nulls":5},"Data OD:","Data DO:"]
[{"$f":"IF(ISERROR(MATCH(ROW()-2,Arkusz1!$C:$C,0)),\"\",INDEX(Arkusz1!C:C,MATCH(ROW()-2,Arkusz1!$C:$C,0)))","v":2},{"$f":"IF(ISERROR(MATCH(ROW()-2,Arkusz1!$C:$C,0)),\"\",INDEX('import danych'!$A:$A,MATCH(ROW()-2,Arkusz1!$C:$C,0)+5))","v":"2012-09-20"},{"$f":"IF(A4=\"\",\"\",DATEVALUE(B4))","v":41172},{"$f":"IF(ISERROR(MATCH(ROW()-2,Arkusz1!$C:$C,0)),\"\",INDEX('import danych'!$B:$B,MATCH(ROW()-2,Arkusz1!$C:$C,0)+5))","v":"13:24"},{"$f":"IF(ISERROR(MATCH(ROW()-2,Arkusz1!$C:$C,0)),\"\",INDEX(Arkusz1!I:I,MATCH(ROW()-2,Arkusz1!$C:$C,0)))","v":"TEST 1"},{"$f":"IF(ISERROR(MATCH(ROW()-2,Arkusz1!$C:$C,0)),\"\",INDEX('import danych'!$H:$H,MATCH(ROW()-2,Arkusz1!$C:$C,0)+5))","v":13319},{"$f":"IF(ISERROR(MATCH(ROW()-2,Arkusz1!$C:$C,0)),\"\",INDEX('import danych'!$L:$L,MATCH(ROW()-2,Arkusz1!$C:$C,0)+5))","v":1.55},{"$f":"A4","v":2},null,"Raport 01",{"$nulls":3},"2012-09-20","2012-11-01"]
[{"$f":"IF(ISERROR(MATCH(ROW()-2,Arkusz1!$C:$C,0)),\"\",INDEX(Arkusz1!C:C,MATCH(ROW()-2,Arkusz1!$C:$C,0)))","v":3},{"$f":"IF(ISERROR(MATCH(ROW()-2,Arkusz1!$C:$C,0)),\"\",INDEX('import danych'!$A:$A,MATCH(ROW()-2,Arkusz1!$C:$C,0)+5))","v":"2012-09-21"},41173,{"$f":"IF(ISERROR(MATCH(ROW()-2,Arkusz1!$C:$C,0)),\"\",INDEX('import danych'!$B:$B,MATCH(ROW()-2,Arkusz1!$C:$C,0)+5))","v":"13:08"},{"$f":"IF(ISERROR(MATCH(ROW()-2,Arkusz1!$C:$C,0)),\"\",INDEX(Arkusz1!I:I,MATCH(ROW()-2,Arkusz1!$C:$C,0)))","v":{"$error":"#REF!"}},{"$f":"IF(ISERROR(MATCH(ROW()-2,Arkusz1!$C:$C,0)),\"\",INDEX('import danych'!$H:$H,MATCH(ROW()-2,Arkusz1!$C:$C,0)+5))","v":13337},{"$f":"IF(ISERROR(MATCH(ROW()-2,Arkusz1!$C:$C,0)),\"\",INDEX('import danych'!$L:$L,MATCH(ROW()-2,Arkusz1!$C:$C,0)+5))","v":44.480000000000004},3]
[{"$f":"IF(ISERROR(MATCH(ROW()-2,Arkusz1!$C:$C,0)),\"\",INDEX(Arkusz1!C:C,MATCH(ROW()-2,Arkusz1!$C:$C,0)))","v":4},{"$f":"IF(ISERROR(MATCH(ROW()-2,Arkusz1!$C:$C,0)),\"\",INDEX('import danych'!$A:$A,MATCH(ROW()-2,Arkusz1!$C:$C,0)+5))","v":"2012-09-22"},41174,{"$f":"IF(ISERROR(MATCH(ROW()-2,Arkusz1!$C:$C,0)),\"\",INDEX('import danych'!$B:$B,MATCH(ROW()-2,Arkusz1!$C:$C,0)+5))","v":"12:54"},{"$f":"IF(ISERROR(MATCH(ROW()-2,Arkusz1!$C:$C,0)),\"\",INDEX(Arkusz1!I:I,MATCH(ROW()-2,Arkusz1!$C:$C,0)))","v":{"$error":"#REF!"}},{"$f":"IF(ISERROR(MATCH(ROW()-2,Arkusz1!$C:$C,0)),\"\",INDEX('import danych'!$H:$H,MATCH(ROW()-2,Arkusz1!$C:$C,0)+5))","v":13348},{"$f":"IF(ISERROR(MATCH(ROW()-2,Arkusz1!$C:$C,0)),\"\",INDEX('import danych'!$L:$L,MATCH(ROW()-2,Arkusz1!$C:$C,0)+5))","v":31.27},4,null,"Lp.","Data","Godzina","Stan motogodzin","Zatankowane paliwo","Pracownik"]
[{"$f":"IF(ISERROR(MATCH(ROW()-2,Arkusz1!$C:$C,0)),\"\",INDEX(Arkusz1!C:C,MATCH(ROW()-2,Arkusz1!$C:$C,0)))","v":5},{"$f":"IF(ISERROR(MATCH(ROW()-2,Arkusz1!$C:$C,0)),\"\",INDEX('import danych'!$A:$A,MATCH(ROW()-2,Arkusz1!$C:$C,0)+5))","v":"2012-09-24"},41176,{"$f":"IF(ISERROR(MATCH(ROW()-2,Arkusz1!$C:$C,0)),\"\",INDEX('import danych'!$B:$B,MATCH(ROW()-2,Arkusz1!$C:$C,0)+5))","v":"12:36"},{"$f":"IF(ISERROR(MATCH(ROW()-2,Arkusz1!$C:$C,0)),\"\",INDEX(Arkusz1!I:I,MATCH(ROW()-2,Arkusz1!$C:$C,0)))","v":{"$error":"#REF!"}},{"$f":"IF(ISERROR(MATCH(ROW()-2,Arkusz1!$C:$C,0)),\"\",INDEX('import danych'!$H:$H,MATCH(ROW()-2,Arkusz1!$C:$C,0)+5))","v":13354},{"$f":"IF(ISERROR(MATCH(ROW()-2,Arkusz1!$C:$C,0)),\"\",INDEX('import danych'!$L:$L,MATCH(ROW()-2,Arkusz1!$C:$C,0)+5))","v":14.63},5,null,{"$f":"IF(K7=\"\",\"\",ROW()-6)","v":1},{"$f":"LOOKUP($K$1,A:A,B:B)","v":"2012-09-20"},{"$f":"LOOKUP(K1,A:A,D:D)","v":"13:24"},{"$f":"LOOKUP($K1,$A:$A,F:F)","v":13319},{"$f":"LOOKUP($K$1,$A:$A,$G:$G)","v":1.55},1]
[{"$f":"IF(ISERROR(MATCH(ROW()-2,Arkusz1!$C:$C,0)),\"\",INDEX(Arkusz1!C:C,MATCH(ROW()-2,Arkusz1!$C:$C,0)))","v":6},{"$f":"IF(ISERROR(MATCH(ROW()-2,Arkusz1!$C:$C,0)),\"\",INDEX('import danych'!$A:$A,MATCH(ROW()-2,Arkusz1!$C:$C,0)+5))","v":"2012-09-25"},41177,{"$f":"IF(ISERROR(MATCH(ROW()-2,Arkusz1!$C:$C,0)),\"\",INDEX('import danych'!$B:$B,MATCH(ROW()-2,Arkusz1!$C:$C,0)+5))","v":"08:53"},{"$f":"IF(ISERROR(MATCH(ROW()-2,Arkusz1!$C:$C,0)),\"\",INDEX(Arkusz1!I:I,MATCH(ROW()-2,Arkusz1!$C:$C,0)))","v":{"$error":"#REF!"}},{"$f":"IF(ISERROR(MATCH(ROW()-2,Arkusz1!$C:$C,0)),\"\",INDEX('import danych'!$H:$H,MATCH(ROW()-2,Arkusz1!$C:$C,0)+5))","v":13371},{"$f":"IF(ISERROR(MATCH(ROW()-2,Arkusz1!$C:$C,0)),\"\",INDEX('import danych'!$L:$L,MATCH(ROW()-2,Arkusz1!$C:$C,0)+5))","v":43.92},6,null,{"$f":"IF(J7>$K$2-$K$1,\"\",J7+1)","v":2},{"$f":"IF($J8=\"\",\"\",LOOKUP($K$1+$J7,$A:$A,$B:$B))","v":"2012-09-21"},{"$f":"IF($J8=\"\",\"\",LOOKUP($K$1+$J7,$A:$A,$D:$D))","v":"13:08"},{"$f":"IF($J8=\"\",\"\",LOOKUP($K$1+$J7,$A:$A,$F:$F))","v":13337},{"$f":"IF($J8=\"\",\"\",LOOKUP($K$1+$J7,$A:$A,$G:$G))","v":44.480000000000004},2]
[{"$f":"IF(ISERROR(MATCH(ROW()-2,Arkusz1!$C:$C,0)),\"\",INDEX(Arkusz1!C:C,MATCH(ROW()-2,Arkusz1!$C:$C,0)))","v":7},{"$f":"IF(ISERROR(MATCH(ROW()-2,Arkusz1!$C:$C,0)),\"\",INDEX('import danych'!$A:$A,MATCH(ROW()-2,Arkusz1!$C:$C,0)+5))","v":"2012-09-26"},41178,{"$f":"IF(ISERROR(MATCH(ROW()-2,Arkusz1!$C:$C,0)),\"\",INDEX('import danych'!$B:$B,MATCH(ROW()-2,Arkusz1!$C:$C,0)+5))","v":"09:36"},{"$f":"IF(ISERROR(MATCH(ROW()-2,Arkusz1!$C:$C,0)),\"\",INDEX(Arkusz1!I:I,MATCH(ROW()-2,Arkusz1!$C:$C,0)))","v":{"$error":"#REF!"}},{"$f":"IF(ISERROR(MATCH(ROW()-2,Arkusz1!$C:$C,0)),\"\",INDEX('import danych'!$H:$H,MATCH(ROW()-2,Arkusz1!$C:$C,0)+5))","v":13386},{"$f":"IF(ISERROR(MATCH(ROW()-2,Arkusz1!$C:$C,0)),\"\",INDEX('import danych'!$L:$L,MATCH(ROW()-2,Arkusz1!$C:$C,0)+5))","v":41.02},7,null,3,"2012-09-22","12:54",13348,31.27,3,null,"Ilość wykonanych motogodzin:",null,{"$f":"MAX(M:M)-MIN(M:M)","v":555}]
[{"$f":"IF(ISERROR(MATCH(ROW()-2,Arkusz1!$C:$C,0)),\"\",INDEX(Arkusz1!C:C,MATCH(ROW()-2,Arkusz1!$C:$C,0)))","v":8},{"$f":"IF(ISERROR(MATCH(ROW()-2,Arkusz1!$C:$C,0)),\"\",INDEX('import danych'!$A:$A,MATCH(ROW()-2,Arkusz1!$C:$C,0)+5))","v":"2012-09-27"},41179,{"$f":"IF(ISERROR(MATCH(ROW()-2,Arkusz1!$C:$C,0)),\"\",INDEX('import danych'!$B:$B,MATCH(ROW()-2,Arkusz1!$C:$C,0)+5))","v":"11:32"},{"$f":"IF(ISERROR(MATCH(ROW()-2,Arkusz1!$C:$C,0)),\"\",INDEX(Arkusz1!I:I,MATCH(ROW()-2,Arkusz1!$C:$C,0)))","v":{"$error":"#REF!"}},{"$f":"IF(ISERROR(MATCH(ROW()-2,Arkusz1!$C:$C,0)),\"\",INDEX('import danych'!$H:$H,MATCH(ROW()-2,Arkusz1!$C:$C,0)+5))","v":13398},{"$f":"IF(ISERROR(MATCH(ROW()-2,Arkusz1!$C:$C,0)),\"\",INDEX('import danych'!$L:$L,MATCH(ROW()-2,Arkusz1!$C:$C,0)+5))","v":32.57},8,null,4,"2012-09-24","12:36",13354,14.63,4,null,"Ilość zatankowanego paliwa:",null,{"$f":"SUM(N:N)","v":1494.0900000000001}]
{"$rows_left_out":191}
{"sheet":"import danych","index":1,"n_rows":150,"n_cols":12,"rows_kept":150}
[{"$f":"IF([1]Sheet1!A1=\"\",\"\",[1]Sheet1!A1)","v":""},{"$f":"IF([1]Sheet1!B1=\"\",\"\",[1]Sheet1!B1)","v":""},{"$f":"IF([1]Sheet1!C1=\"\",\"\",[1]Sheet1!C1)","v":""},{"$f":"IF([1]Sheet1!D1=\"\",\"\",[1]Sheet1!D1)","v":""},{"$f":"IF([1]Sheet1!E1=\"\",\"\",[1]Sheet1!E1)","v":""},{"$f":"IF([1]Sheet1!F1=\"\",\"\",[1]Sheet1!F1)","v":""},{"$f":"IF([1]Sheet1!G1=\"\",\"\",[1]Sheet1!G1)","v":""},{"$f":"IF([1]Sheet1!H1=\"\",\"\",[1]Sheet1!H1)","v":""},{"$f":"IF([1]Sheet1!I1=\"\",\"\",[1]Sheet1!I1)","v":""},{"$f":"IF([1]Sheet1!J1=\"\",\"\",[1]Sheet1!J1)","v":""},{"$f":"IF([1]Sheet1!K1=\"\",\"\",[1]Sheet1!K1)","v":""},{"$f":"IF([1]Sheet1!L1=\"\",\"\",[1]Sheet1!L1)","v":""}]
[null,{"$f":"IF([1]Sheet1!B2=\"\",\"\",[1]Sheet1!B2)","v":""},{"$f":"IF([1]Sheet1!C2=\"\",\"\",[1]Sheet1!C2)","v":""},{"$f":"IF([1]Sheet1!D2=\"\",\"\",[1]Sheet1!D2)","v":""},{"$f":"IF([1]Sheet1!E2=\"\",\"\",[1]Sheet1!E2)","v":""},{"$f":"IF([1]Sheet1!F2=\"\",\"\",[1]Sheet1!F2)","v":""},{"$f":"IF([1]Sheet1!G2=\"\",\"\",[1]Sheet1!G2)","v":""},{"$f":"IF([1]Sheet1!H2=\"\",\"\",[1]Sheet1!H2)","v":""},{"$f":"IF([1]Sheet1!I2=\"\",\"\",[1]Sheet1!I2)","v":""},{"$f":"IF([1]Sheet1!J2=\"\",\"\",[1]Sheet1!J2)","v":""},{"$f":"IF([1]Sheet1!K2=\"\",\"\",[1]Sheet1!K2)","v":""},{"$f":"IF([1]Sheet1!L2=\"\",\"\",[1]Sheet1!L2)","v":"2012-11-02  14:07:37"}]
[{"$f":"IF([1]Sheet1!A3=\"\",\"\",[1]Sheet1!A3)","v":""},{"$f":"IF([1]Sheet1!B3=\"\",\"\",[1]Sheet1!B3)","v":""},{"$f":"IF([1]Sheet1!C3=\"\",\"\",[1]Sheet1!C3)","v":""},{"$f":"IF([1]Sheet1!D3=\"\",\"\",[1]Sheet1!D3)","v":""},{"$f":"IF([1]Sheet1!E3=\"\",\"\",[1]Sheet1!E3)","v":""},{"$f":"IF([1]Sheet1!F3=\"\",\"\",[1]Sheet1!F3)","v":"Lista odbiorców"},{"$f":"IF([1]Sheet1!G3=\"\",\"\",[1]Sheet1!G3)","v":""},{"$f":"IF([1]Sheet1!H3=\"\",\"\",[1]Sheet1!H3)","v":""},{"$f":"IF([1]Sheet1!I3=\"\",\"\",[1]Sheet1!I3)","v":""},{"$f":"IF([1]Sheet1!J3=\"\",\"\",[1]Sheet1!J3)","v":""},{"$f":"IF([1]Sheet1!K3=\"\",\"\",[1]Sheet1!K3)","v":""},{"$f":"IF([1]Sheet1!L3=\"\",\"\",[1]Sheet1!L3)","v":""}]
[{"$f":"IF([1]Sheet1!A4=\"\",\"\",[1]Sheet1!A4)","v":""},{"$f":"IF([1]Sheet1!B4=\"\",\"\",[1]Sheet1!B4)","v":""},{"$f":"IF([1]Sheet1!C4=\"\",\"\",[1]Sheet1!C4)","v":""},{"$f":"IF([1]Sheet1!D4=\"\",\"\",[1]Sheet1!D4)","v":""},{"$f":"IF([1]Sheet1!E4=\"\",\"\",[1]Sheet1!E4)","v":""},{"$f":"IF([1]Sheet1!F4=\"\",\"\",[1]Sheet1!F4)","v":""},{"$f":"IF([1]Sheet1!G4=\"\",\"\",[1]Sheet1!G4)","v":""},{"$f":"IF([1]Sheet1!H4=\"\",\"\",[1]Sheet1!H4)","v":""},{"$f":"IF([1]Sheet1!I4=\"\",\"\",[1]Sheet1!I4)","v":""},{"$f":"IF([1]Sheet1!J4=\"\",\"\",[1]Sheet1!J4)","v":""},{"$f":"IF([1]Sheet1!K4=\"\",\"\",[1]Sheet1!K4)","v":""},{"$f":"IF([1]Sheet1!L4=\"\",\"\",[1]Sheet1!L4)","v":""}]
[{"$f":"IF([1]Sheet1!A5=\"\",\"\",[1]Sheet1!A5)","v":"Data"},{"$f":"IF([1]Sheet1!B5=\"\",\"\",[1]Sheet1!B5)","v":"Godzina"},{"$f":"IF([1]Sheet1!C5=\"\",\"\",[1]Sheet1!C5)","v":"Dystrybutor"},{"$f":"IF([1]Sheet1!D5=\"\",\"\",[1]Sheet1!D5)","v":"Nr._rejestracyjny"},null,"Pracownik",{"$f":"IF([1]Sheet1!G5=\"\",\"\",[1]Sheet1!G5)","v":""},{"$f":"IF([1]Sheet1!H5=\"\",\"\",[1]Sheet1!H5)","v":"Przebieg"},{"$f":"IF([1]Sheet1!I5=\"\",\"\",[1]Sheet1!I5)","v":"Operator"},{"$f":"IF([1]Sheet1!J5=\"\",\"\",[1]Sheet1!J5)","v":""},{"$f":"IF([1]Sheet1!K5=\"\",\"\",[1]Sheet1!K5)","v":""},{"$f":"IF([1]Sheet1!L5=\"\",\"\",[1]Sheet1!L5)","v":"Ilosc"}]
[{"$f":"IF([1]Sheet1!A6=\"\",\"\",[1]Sheet1!A6)","v":""},{"$f":"IF([1]Sheet1!B6=\"\",\"\",[1]Sheet1!B6)","v":""},{"$f":"IF([1]Sheet1!C6=\"\",\"\",[1]Sheet1!C6)","v":""},{"$f":"IF([1]Sheet1!D6=\"\",\"\",[1]Sheet1!D6)","v":""},null,null,{"$f":"IF([1]Sheet1!G6=\"\",\"\",[1]Sheet1!G6)","v":""},{"$f":"IF([1]Sheet1!H6=\"\",\"\",[1]Sheet1!H6)","v":""},{"$f":"IF([1]Sheet1!I6=\"\",\"\",[1]Sheet1!I6)","v":""},{"$f":"IF([1]Sheet1!J6=\"\",\"\",[1]Sheet1!J6)","v":""},{"$f":"IF([1]Sheet1!K6=\"\",\"\",[1]Sheet1!K6)","v":""},{"$f":"IF([1]Sheet1!L6=\"\",\"\",[1]Sheet1!L6)","v":""}]
[{"$f":"IF([1]Sheet1!A7=\"\",\"\",[1]Sheet1!A7)","v":"2012-09-20"},{"$f":"IF([1]Sheet1!B7=\"\",\"\",[1]Sheet1!B7)","v":"13:24"},{"$f":"IF([1]Sheet1!C7=\"\",\"\",[1]Sheet1!C7)","v":1},{"$f":"IF([1]Sheet1!D7=\"\",\"\",[1]Sheet1!D7)","v":"TEST1"},{"$f":"COUNTIF(D7,\"???\")","v":0},{"$f":"IF(E7=0,\"00\"&D7,D7)","v":"00TEST1"},{"$f":"IF([1]Sheet1!G7=\"\",\"\",[1]Sheet1!G7)","v":""},{"$f":"IF([1]Sheet1!H7=\"\",\"\",[1]Sheet1!H7)","v":13319},{"$f":"IF([1]Sheet1!I7=\"\",\"\",[1]Sheet1!I7)","v":"LINDE 01"},{"$f":"IF([1]Sheet1!J7=\"\",\"\",[1]Sheet1!J7)","v":""},{"$f":"IF([1]Sheet1!K7=\"\",\"\",[1]Sheet1!K7)","v":""},{"$f":"IF([1]Sheet1!L7=\"\",\"\",[1]Sheet1!L7)","v":1.55}]
[{"$f":"IF([1]Sheet1!A8=\"\",\"\",[1]Sheet1!A8)","v":"2012-09-21"},{"$f":"IF([1]Sheet1!B8=\"\",\"\",[1]Sheet1!B8)","v":"13:04"},{"$f":"IF([1]Sheet1!C8=\"\",\"\",[1]Sheet1!C8)","v":1},{"$f":"IF([1]Sheet1!D8=\"\",\"\",[1]Sheet1!D8)","v":"016"},{"$f":"COUNTIF(D8,\"???\")","v":1},{"$f":"IF(E8=0,\"00\"&D8,D8)","v":"016"},{"$f":"IF([1]Sheet1!G8=\"\",\"\",[1]Sheet1!G8)","v":""},{"$f":"IF([1]Sheet1!H8=\"\",\"\",[1]Sheet1!H8)","v":19366},{"$f":"IF([1]Sheet1!I8=\"\",\"\",[1]Sheet1!I8)","v":"LINDE 03"},{"$f":"IF([1]Sheet1!J8=\"\",\"\",[1]Sheet1!J8)","v":""},{"$f":"IF([1]Sheet1!K8=\"\",\"\",[1]Sheet1!K8)","v":""},{"$f":"IF([1]Sheet1!L8=\"\",\"\",[1]Sheet1!L8)","v":36.63}]
[{"$f":"IF([1]Sheet1!A9=\"\",\"\",[1]Sheet1!A9)","v":"2012-09-21"},{"$f":"IF([1]Sheet1!B9=\"\",\"\",[1]Sheet1!B9)","v":"13:08"},{"$f":"IF([1]Sheet1!C9=\"\",\"\",[1]Sheet1!C9)","v":1},{"$f":"IF([1]Sheet1!D9=\"\",\"\",[1]Sheet1!D9)","v":"002"},1,"002",{"$f":"IF([1]Sheet1!G9=\"\",\"\",[1]Sheet1!G9)","v":""},{"$f":"IF([1]Sheet1!H9=\"\",\"\",[1]Sheet1!H9)","v":13337},{"$f":"IF([1]Sheet1!I9=\"\",\"\",[1]Sheet1!I9)","v":"LINDE 01"},{"$f":"IF([1]Sheet1!J9=\"\",\"\",[1]Sheet1!J9)","v":""},{"$f":"IF([1]Sheet1!K9=\"\",\"\",[1]Sheet1!K9)","v":""},{"$f":"IF([1]Sheet1!L9=\"\",\"\",[1]Sheet1!L9)","v":44.480000000000004}]
[{"$f":"IF([1]Sheet1!A10=\"\",\"\",[1]Sheet1!A10)","v":"2012-09-21"},{"$f":"IF([1]Sheet1!B10=\"\",\"\",[1]Sheet1!B10)","v":"13:13"},{"$f":"IF([1]Sheet1!C10=\"\",\"\",[1]Sheet1!C10)","v":1},{"$f":"IF([1]Sheet1!D10=\"\",\"\",[1]Sheet1!D10)","v":"006"},1,"006",{"$f":"IF([1]Sheet1!G10=\"\",\"\",[1]Sheet1!G10)","v":""},{"$f":"IF([1]Sheet1!H10=\"\",\"\",[1]Sheet1!H10)","v":14133},{"$f":"IF([1]Sheet1!I10=\"\",\"\",[1]Sheet1!I10)","v":"LINDE 02"},{"$f":"IF([1]Sheet1!J10=\"\",\"\",[1]Sheet1!J10)","v":""},{"$f":"IF([1]Sheet1!K10=\"\",\"\",[1]Sheet1!K10)","v":""},{"$f":"IF([1]Sheet1!L10=\"\",\"\",[1]Sheet1!L10)","v":45.93}]
{"$rows_left_out":141}
{"sheet":"Arkusz1","index":2,"n_rows":200,"n_cols":9,"rows_kept":200}
["DATA","GODZINA",1,2,3,4,5,6,"PRACOWNIK"]
[{"$f":"'import danych'!A7","v":"2012-09-20"},{"$f":"'import danych'!B7","v":"13:24"},{"$f":"IF('import danych'!$I7=\"LINDE 01\",MAX(C$1:C1)+1,\"\")","v":2},{"$f":"IF('import danych'!$I7=\"LINDE 02\",MAX(D$1:D1)+1,\"\")","v":""},{"$f":"IF('import danych'!$I7=\"LINDE 03\",MAX(E$1:E1)+1,\"\")","v":""},{"$f":"IF('import danych'!$I7=\"YALE 04\",MAX(F$1:F1)+1,\"\")","v":""},{"$f":"IF('import danych'!$I7=\"SUR\",MAX(G$1:G1)+1,\"\")","v":""},{"$f":"IF('import danych'!$I7=\"SMP\",MAX(H$1:H1)+1,\"\")","v":""},"TEST 1"]
[{"$f":"'import danych'!A8","v":"2012-09-21"},{"$f":"'import danych'!B8","v":"13:04"},{"$f":"IF('import danych'!$I8=\"LINDE 01\",MAX(C$1:C2)+1,\"\")","v":""},{"$f":"IF('import danych'!$I8=\"LINDE 02\",MAX(D$1:D2)+1,\"\")","v":""},{"$f":"IF('import danych'!$I8=\"LINDE 03\",MAX(E$1:E2)+1,\"\")","v":4},{"$f":"IF('import danych'!$I8=\"YALE 04\",MAX(F$1:F2)+1,\"\")","v":""},{"$f":"IF('import danych'!$I8=\"SUR\",MAX(G$1:G2)+1,\"\")","v":""},{"$f":"IF('import danych'!$I8=\"SMP\",MAX(H$1:H2)+1,\"\")","v":""},{"$f":"IF('import danych'!E8=\"\",\"\",LOOKUP('import danych'!F8,#REF!,#REF!))","v":{"$error":"#REF!"}}]
[{"$f":"'import danych'!A9","v":"2012-09-21"},{"$f":"'import danych'!B9","v":"13:08"},{"$f":"IF('import danych'!$I9=\"LINDE 01\",MAX(C$1:C3)+1,\"\")","v":3},{"$f":"IF('import danych'!$I9=\"LINDE 02\",MAX(D$1:D3)+1,\"\")","v":""},{"$f":"IF('import danych'!$I9=\"LINDE 03\",MAX(E$1:E3)+1,\"\")","v":""},{"$f":"IF('import danych'!$I9=\"YALE 04\",MAX(F$1:F3)+1,\"\")","v":""},{"$f":"IF('import danych'!$I9=\"SUR\",MAX(G$1:G3)+1,\"\")","v":""},{"$f":"IF('import danych'!$I9=\"SMP\",MAX(H$1:H3)+1,\"\")","v":""},{"$f":"IF('import danych'!E9=\"\",\"\",LOOKUP('import danych'!F9,#REF!,#REF!))","v":{"$error":"#REF!"}}]
[{"$f":"'import danych'!A10","v":"2012-09-21"},{"$f":"'import danych'!B10","v":"13:13"},{"$f":"IF('import danych'!$I10=\"LINDE 01\",MAX(C$1:C4)+1,\"\")","v":""},{"$f":"IF('import danych'!$I10=\"LINDE 02\",MAX(D$1:D4)+1,\"\")","v":3},{"$f":"IF('import danych'!$I10=\"LINDE 03\",MAX(E$1:E4)+1,\"\")","v":""},{"$f":"IF('import danych'!$I10=\"YALE 04\",MAX(F$1:F4)+1,\"\")","v":""},{"$f":"IF('import danych'!$I10=\"SUR\",MAX(G$1:G4)+1,\"\")","v":""},{"$f":"IF('import danych'!$I10=\"SMP\",MAX(H$1:H4)+1,\"\")","v":""},{"$f":"IF('import danych'!E10=\"\",\"\",LOOKUP('import danych'!F10,#REF!,#REF!))","v":{"$error":"#REF!"}}]
[{"$f":"'import danych'!A11","v":"2012-09-22"},{"$f":"'import danych'!B11","v":"12:54"},{"$f":"IF('import danych'!$I11=\"LINDE 01\",MAX(C$1:C5)+1,\"\")","v":4},{"$f":"IF('import danych'!$I11=\"LINDE 02\",MAX(D$1:D5)+1,\"\")","v":""},{"$f":"IF('import danych'!$I11=\"LINDE 03\",MAX(E$1:E5)+1,\"\")","v":""},{"$f":"IF('import danych'!$I11=\"YALE 04\",MAX(F$1:F5)+1,\"\")","v":""},{"$f":"IF('import danych'!$I11=\"SUR\",MAX(G$1:G5)+1,\"\")","v":""},{"$f":"IF('import danych'!$I11=\"SMP\",MAX(H$1:H5)+1,\"\")","v":""},{"$f":"IF('import danych'!E11=\"\",\"\",LOOKUP('import danych'!F11,#REF!,#REF!))","v":{"$error":"#REF!"}}]
[{"$f":"'import danych'!A12","v":"2012-09-22"},{"$f":"'import danych'!B12","v":"12:57"},{"$f":"IF('import danych'!$I12=\"LINDE 01\",MAX(C$1:C6)+1,\"\")","v":""},{"$f":"IF('import danych'!$I12=\"LINDE 02\",MAX(D$1:D6)+1,\"\")","v":4},{"$f":"IF('import danych'!$I12=\"LINDE 03\",MAX(E$1:E6)+1,\"\")","v":""},{"$f":"IF('import danych'!$I12=\"YALE 04\",MAX(F$1:F6)+1,\"\")","v":""},{"$f":"IF('import danych'!$I12=\"SUR\",MAX(G$1:G6)+1,\"\")","v":""},{"$f":"IF('import danych'!$I12=\"SMP\",MAX(H$1:H6)+1,\"\")","v":""},{"$f":"IF('import danych'!E12=\"\",\"\",LOOKUP('import danych'!F12,#REF!,#REF!))","v":{"$error":"#REF!"}}]
[{"$f":"'import danych'!A13","v":"2012-09-22"},{"$f":"'import danych'!B13","v":"13:03"},{"$f":"IF('import danych'!$I13=\"LINDE 01\",MAX(C$1:C7)+1,\"\")","v":""},{"$f":"IF('import danych'!$I13=\"LINDE 02\",MAX(D$1:D7)+1,\"\")","v":""},{"$f":"IF('import danych'!$I13=\"LINDE 03\",MAX(E$1:E7)+1,\"\")","v":5},{"$f":"IF('import danych'!$I13=\"YALE 04\",MAX(F$1:F7)+1,\"\")","v":""},{"$f":"IF('import danych'!$I13=\"SUR\",MAX(G$1:G7)+1,\"\")","v":""},{"$f":"IF('import danych'!$I13=\"SMP\",MAX(H$1:H7)+1,\"\")","v":""},{"$f":"IF('import danych'!E13=\"\",\"\",LOOKUP('import danych'!F13,#REF!,#REF!))","v":{"$error":"#REF!"}}]
[{"$f":"'import danych'!A14","v":"2012-09-24"},{"$f":"'import danych'!B14","v":"12:31"},{"$f":"IF('import danych'!$I14=\"LINDE 01\",MAX(C$1:C8)+1,\"\")","v":""},{"$f":"IF('import danych'!$I14=\"LINDE 02\",MAX(D$1:D8)+1,\"\")","v":5},{"$f":"IF('import danych'!$I14=\"LINDE 03\",MAX(E$1:E8)+1,\"\")","v":""},{"$f":"IF('import danych'!$I14=\"YALE 04\",MAX(F$1:F8)+1,\"\")","v":""},{"$f":"IF('import danych'!$I14=\"SUR\",MAX(G$1:G8)+1,\"\")","v":""},{"$f":"IF('import danych'!$I14=\"SMP\",MAX(H$1:H8)+1,\"\")","v":""},{"$f":"IF('import danych'!E14=\"\",\"\",LOOKUP('import danych'!F14,#REF!,#REF!))","v":{"$error":"#REF!"}}]
[{"$f":"'import danych'!A15","v":"2012-09-24"},{"$f":"'import danych'!B15","v":"12:36"},{"$f":"IF('import danych'!$I15=\"LINDE 01\",MAX(C$1:C9)+1,\"\")","v":5},{"$f":"IF('import danych'!$I15=\"LINDE 02\",MAX(D$1:D9)+1,\"\")","v":""},{"$f":"IF('import danych'!$I15=\"LINDE 03\",MAX(E$1:E9)+1,\"\")","v":""},{"$f":"IF('import danych'!$I15=\"YALE 04\",MAX(F$1:F9)+1,\"\")","v":""},{"$f":"IF('import danych'!$I15=\"SUR\",MAX(G$1:G9)+1,\"\")","v":""},{"$f":"IF('import danych'!$I15=\"SMP\",MAX(H$1:H9)+1,\"\")","v":""},{"$f":"IF('import danych'!E15=\"\",\"\",LOOKUP('import danych'!F15,#REF!,#REF!))","v":{"$error":"#REF!"}}]
{"$rows_left_out":191}
{"sheet":"Stan Zbiornika","index":3,"n_rows":24,"n_cols":12,"rows_kept":24,"merged":[[5,5,5,8],[6,5,6,6],[7,5,8,5],[7,8,8,8],[10,5,10,6],[11,5,11,6],[12,5,12,6],[13,5,13,6]]}
["Lp.","Data","wartość"]
[{"$f":"IF(B2=\"\",\"\",ROW()-1)","v":1},"2012-09-17",4937]
[{"$f":"IF(B3=\"\",\"\",ROW()-1)","v":""},{"$nulls":6},"Data:","2012-10-31",null,null,"01"]
["",{"$nulls":6},"stan aktualny",{"$f":"SUM(C:C)-SUM('import danych'!L:L)","v":{"v":749.5600000000004,"d":"749.56 l"}},null,null,"Arkusz 2"]
["",{"$nulls":10},"Arkusz 3"]
["",{"$nulls":4},"Podział procentowy",{"$nulls":5},"Arkusz 4"]
["",{"$nulls":4},"Jednostka organizacyjna",null,"ilość","udział procentowy",null,null,"Arkusz 5"]
["",{"$nulls":5},1,{"$f":"SUMIFS('import danych'!L:L,'import danych'!I:I,\"LINDE 01\")","v":{"v":1494.0900000000001,"d":"1494.09 l"}},{"$f":"SUM($H$8,$H$9)*100/SUM(H8:H12)","v":{"v":77.49102062230114,"d":"77 %"}},null,null,"Arkusz 6"]
["",{"$nulls":5},2,{"$f":"SUMIFS('import danych'!L:L,'import danych'!I:I,\"LINDE 02\")","v":{"v":1578.15,"d":"1578.15 l"}},{"$nulls":3},"Aktualny"]
["",{"$nulls":5},3,{"$f":"SUMIFS('import danych'!L:L,'import danych'!I:I,\"LINDE 03\")","v":{"v":789.59,"d":"789.59 l"}},{"$f":"H10*100/SUM(H8:H12)","v":{"v":19.915805722587674,"d":"20 %"}},null,null,"data od"]
{"$rows_left_out":14}